BDBM50067200 CHEMBL3187348
SMILES: COc1ccc(cc1OC1CCN(CC1)C(C)C)C(=O)NCc1csc(C)n1
InChI Key: InChIKey=FWNNFDXOWQESMM-UHFFFAOYSA-N
Data: 6 IC50
Activity Spreadsheet -- Enzyme Inhibition Constant Data from BindingDB
Found 6 hits for monomerid = 50067200
Trg + Lig
Ki
nM
ΔG°
kcal/mole
IC50
nM
Kd
nM
EC50/IC50
nM
koff
s-1
kon
M-1s-1
pHTemp
°C
High-affinity choline transporter
(Homo sapiens (Human))
BDBM50067200
(CHEMBL3187348)
Show SMILES COc1ccc(cc1OC1CCN(CC1)C(C)C)C(=O)NCc1csc(C)n1
Show InChI InChI=1S/C21H29N3O3S/c1-14(2)24-9-7-18(8-10-24)27-20-11-16(5-6-19(20)26-4)21(25)22-12-17-13-28-15(3)23-17/h5-6,11,13-14,18H,7-10,12H2,1-4H3,(H,22,25)
Reactome pathway
n/an/a 4.93E+3n/an/an/an/an/an/a
Vanderbilt University Medical Center
Curated by ChEMBL
Assay Description
Inhibition of human CHT Leu530Ala and Val531Ala mutant expressed in HEK293 cells assessed as remaining transporter activity in presence of 100 nM [3H...
Bioorg Med Chem Lett 25: 1757-60 (2015)
Article DOI: 10.1016/j.bmcl.2015.02.058
BindingDB Entry DOI: 10.7270/Q24J0GTX
High-affinity choline transporter
(Homo sapiens (Human))
BDBM50067200
(CHEMBL3187348)
Show SMILES COc1ccc(cc1OC1CCN(CC1)C(C)C)C(=O)NCc1csc(C)n1
Show InChI InChI=1S/C21H29N3O3S/c1-14(2)24-9-7-18(8-10-24)27-20-11-16(5-6-19(20)26-4)21(25)22-12-17-13-28-15(3)23-17/h5-6,11,13-14,18H,7-10,12H2,1-4H3,(H,22,25)
Reactome pathway
n/an/a 1.64E+3n/an/an/an/an/an/a
Vanderbilt University Medical Center
Curated by ChEMBL
Assay Description
Inhibition of human CHT Leu530Ala and Val531Ala mutant expressed in HEK293 cells assessed as remaining transporter activity in presence of 10 uM [3H]...
Bioorg Med Chem Lett 25: 1757-60 (2015)
Article DOI: 10.1016/j.bmcl.2015.02.058
BindingDB Entry DOI: 10.7270/Q24J0GTX
Cytochrome P450 3A4
(Homo sapiens (Human))
BDBM50067200
(CHEMBL3187348)
Show SMILES COc1ccc(cc1OC1CCN(CC1)C(C)C)C(=O)NCc1csc(C)n1
Show InChI InChI=1S/C21H29N3O3S/c1-14(2)24-9-7-18(8-10-24)27-20-11-16(5-6-19(20)26-4)21(25)22-12-17-13-28-15(3)23-17/h5-6,11,13-14,18H,7-10,12H2,1-4H3,(H,22,25)
Reactome pathway
n/an/a>3.00E+4n/an/an/an/an/an/a
Vanderbilt University Medical Center
Curated by ChEMBL
Assay Description
Inhibition of human CYP3A4
Bioorg Med Chem Lett 25: 1757-60 (2015)
Article DOI: 10.1016/j.bmcl.2015.02.058
BindingDB Entry DOI: 10.7270/Q24J0GTX
Cytochrome P450 2C9
(Homo sapiens (Human))
BDBM50067200
(CHEMBL3187348)
Show SMILES COc1ccc(cc1OC1CCN(CC1)C(C)C)C(=O)NCc1csc(C)n1
Show InChI InChI=1S/C21H29N3O3S/c1-14(2)24-9-7-18(8-10-24)27-20-11-16(5-6-19(20)26-4)21(25)22-12-17-13-28-15(3)23-17/h5-6,11,13-14,18H,7-10,12H2,1-4H3,(H,22,25)
Reactome pathway
n/an/a>3.00E+4n/an/an/an/an/an/a
Vanderbilt University Medical Center
Curated by ChEMBL
Assay Description
Inhibition of human CYP2C9
Bioorg Med Chem Lett 25: 1757-60 (2015)
Article DOI: 10.1016/j.bmcl.2015.02.058
BindingDB Entry DOI: 10.7270/Q24J0GTX
Cytochrome P450 2D6
(Homo sapiens (Human))
BDBM50067200
(CHEMBL3187348)
Show SMILES COc1ccc(cc1OC1CCN(CC1)C(C)C)C(=O)NCc1csc(C)n1
Show InChI InChI=1S/C21H29N3O3S/c1-14(2)24-9-7-18(8-10-24)27-20-11-16(5-6-19(20)26-4)21(25)22-12-17-13-28-15(3)23-17/h5-6,11,13-14,18H,7-10,12H2,1-4H3,(H,22,25)
n/an/a>3.00E+4n/an/an/an/an/an/a
Vanderbilt University Medical Center
Curated by ChEMBL
Assay Description
Inhibition of human CYP2D6
Bioorg Med Chem Lett 25: 1757-60 (2015)
Article DOI: 10.1016/j.bmcl.2015.02.058
BindingDB Entry DOI: 10.7270/Q24J0GTX
Cytochrome P450 1A
(Homo sapiens (Human))
BDBM50067200
(CHEMBL3187348)
Show SMILES COc1ccc(cc1OC1CCN(CC1)C(C)C)C(=O)NCc1csc(C)n1
Show InChI InChI=1S/C21H29N3O3S/c1-14(2)24-9-7-18(8-10-24)27-20-11-16(5-6-19(20)26-4)21(25)22-12-17-13-28-15(3)23-17/h5-6,11,13-14,18H,7-10,12H2,1-4H3,(H,22,25)
Reactome pathway
n/an/a 1.03E+4n/an/an/an/an/an/a
Vanderbilt University Medical Center
Curated by ChEMBL
Assay Description
Inhibition of human CYP1A2
Bioorg Med Chem Lett 25: 1757-60 (2015)
Article DOI: 10.1016/j.bmcl.2015.02.058
BindingDB Entry DOI: 10.7270/Q24J0GTX