BDBM50067380 2'-(4-nitrobenzyl)spiro[tetrahydro-1H-pyrrole-3,4'-(1',2',3',4'-tetrahydropyrrolo[1,2-a]pyrazine)]-1',2,3',5-tetraone::CHEMBL133791
SMILES: [O-][N+](=O)c1ccc(CN2C(=O)c3cccn3C3(CC(=O)NC3=O)C2=O)cc1
InChI Key: InChIKey=AHYQNEKGAJTQAW-UHFFFAOYSA-N
Data: 1 IC50
Activity Spreadsheet -- Enzyme Inhibition Constant Data from BindingDB
Found 1 hit for monomerid = 50067380
Trg + Lig
Ki
nM
ΔG°
kcal/mole
IC50
nM
Kd
nM
EC50/IC50
nM
koff
s-1
kon
M-1s-1
pHTemp
°C
Aldose reductase
(Sus scrofa)
BDBM50067380
(2'-(4-nitrobenzyl)spiro[tetrahydro-1H-pyrrole-3,4'...)
Show SMILES [O-][N+](=O)c1ccc(CN2C(=O)c3cccn3C3(CC(=O)NC3=O)C2=O)cc1
Show InChI InChI=1S/C17H12N4O6/c22-13-8-17(15(24)18-13)16(25)19(14(23)12-2-1-7-20(12)17)9-10-3-5-11(6-4-10)21(26)27/h1-7H,8-9H2,(H,18,22,24)
Reactome pathway
n/an/a 110n/an/an/an/an/an/a
Dainippon Pharmaceutical Company, Ltd.
Curated by ChEMBL
Assay Description
In vitro inhibitory activity against aldose reductase in porcine lens.
J Med Chem 41: 4118-29 (1998)
Article DOI: 10.1021/jm9802968
BindingDB Entry DOI: 10.7270/Q20V8BXH