BDBM50067390 2'-(3,4-dichlorobenzyl)spiro[tetrahydro-1H-pyrrole-3,4'-(1',2',3',4'-tetrahydropyrrolo[1,2-a]pyrazine)]-1',2,3',5-tetraone::CHEMBL133731
SMILES: Clc1ccc(CN2C(=O)c3cccn3C3(CC(=O)NC3=O)C2=O)cc1Cl
InChI Key: InChIKey=RAAQRCNECYMLHM-UHFFFAOYSA-N
Data: 1 IC50
Activity Spreadsheet -- Enzyme Inhibition Constant Data from BindingDB
Found 1 hit for monomerid = 50067390
Trg + Lig
Ki
nM
ΔG°
kcal/mole
IC50
nM
Kd
nM
EC50/IC50
nM
koff
s-1
kon
M-1s-1
pHTemp
°C
Aldose reductase
(Sus scrofa)
BDBM50067390
(2'-(3,4-dichlorobenzyl)spiro[tetrahydro-1H-pyrrole...)
Show SMILES Clc1ccc(CN2C(=O)c3cccn3C3(CC(=O)NC3=O)C2=O)cc1Cl
Show InChI InChI=1S/C17H11Cl2N3O4/c18-10-4-3-9(6-11(10)19)8-21-14(24)12-2-1-5-22(12)17(16(21)26)7-13(23)20-15(17)25/h1-6H,7-8H2,(H,20,23,25)
Reactome pathway
n/an/a 23n/an/an/an/an/an/a
Dainippon Pharmaceutical Company, Ltd.
Curated by ChEMBL
Assay Description
In vitro inhibitory activity against aldose reductase in porcine lens.
J Med Chem 41: 4118-29 (1998)
Article DOI: 10.1021/jm9802968
BindingDB Entry DOI: 10.7270/Q20V8BXH