BDBM50067411 2'-(2-fluorobenzyl)spiro[tetrahydro-1H-pyrrole-3,4'-(1',2',3',4'-tetrahydropyrrolo[1,2-a]pyrazine)]-1',2,3',5-tetraone::CHEMBL422439
SMILES: Fc1ccccc1CN1C(=O)c2cccn2C2(CC(=O)NC2=O)C1=O
InChI Key: InChIKey=OUZICIYDFQJBQJ-UHFFFAOYSA-N
Data: 1 IC50
Activity Spreadsheet -- Enzyme Inhibition Constant Data from BindingDB
Found 1 hit for monomerid = 50067411
Trg + Lig
Ki
nM
ΔG°
kcal/mole
IC50
nM
Kd
nM
EC50/IC50
nM
koff
s-1
kon
M-1s-1
pHTemp
°C
Aldose reductase
(Sus scrofa)
BDBM50067411
(2'-(2-fluorobenzyl)spiro[tetrahydro-1H-pyrrole-3,4...)
Show SMILES Fc1ccccc1CN1C(=O)c2cccn2C2(CC(=O)NC2=O)C1=O
Show InChI InChI=1S/C17H12FN3O4/c18-11-5-2-1-4-10(11)9-20-14(23)12-6-3-7-21(12)17(16(20)25)8-13(22)19-15(17)24/h1-7H,8-9H2,(H,19,22,24)
Reactome pathway
n/an/a 61n/an/an/an/an/an/a
Dainippon Pharmaceutical Company, Ltd.
Curated by ChEMBL
Assay Description
In vitro inhibitory activity against aldose reductase in porcine lens.
J Med Chem 41: 4118-29 (1998)
Article DOI: 10.1021/jm9802968
BindingDB Entry DOI: 10.7270/Q20V8BXH