BDBM50067892 4-Bromophenyl-boronic acid::4-bromo phenyl boronic acid::4-bromophenyl boronic acid::4-bromophenylboronic acid::Boronic acid derivative::CHEMBL20866
SMILES: OB(O)c1ccc(Br)cc1
InChI Key: InChIKey=QBLFZIBJXUQVRF-UHFFFAOYSA-N
Data: 10 KI
Activity Spreadsheet -- Enzyme Inhibition Constant Data from BindingDB
Found 10 hits for monomerid = 50067892
Trg + Lig
Ki
nM
ΔG°
kcal/mole
IC50
nM
Kd
nM
EC50/IC50
nM
koff
s-1
kon
M-1s-1
pHTemp
°C
Beta-lactamase
(Escherichia coli)
BDBM50067892
(4-Bromophenyl-boronic acid | 4-bromo phenyl boroni...)
Show SMILES OB(O)c1ccc(Br)cc1
Show InChI InChI=1S/C6H6BBrO2/c8-6-3-1-5(2-4-6)7(9)10/h1-4,9-10H
3.60E+3n/an/an/an/an/an/an/an/a
Northwestern University Medical School
Curated by ChEMBL
Assay Description
Inhibitory activity against E. coli AmpC beta-lactamase.
J Med Chem 41: 4577-86 (1998)
Article DOI: 10.1021/jm980343w
BindingDB Entry DOI: 10.7270/Q22N51FX
Carbonic anhydrase 2
(Homo sapiens (Human))
BDBM50067892
(4-Bromophenyl-boronic acid | 4-bromo phenyl boroni...)
Show SMILES OB(O)c1ccc(Br)cc1
Show InChI InChI=1S/C6H6BBrO2/c8-6-3-1-5(2-4-6)7(9)10/h1-4,9-10H
Reactome pathway
7.00E+3n/an/an/an/an/an/an/an/a
Universit£ degli Studi di Firenze
Curated by ChEMBL
Assay Description
Inhibition of human recombinant cytosolic carbonic anhydrase 2 preincubated for 15 mins by CO2 hydration stopped-flow assay
Bioorg Med Chem Lett 19: 2642-5 (2009)
Article DOI: 10.1016/j.bmcl.2009.03.147
BindingDB Entry DOI: 10.7270/Q27D2V4T
Subtilisin BL
(Bacillus lentus)
BDBM50067892
(4-Bromophenyl-boronic acid | 4-bromo phenyl boroni...)
Show SMILES OB(O)c1ccc(Br)cc1
Show InChI InChI=1S/C6H6BBrO2/c8-6-3-1-5(2-4-6)7(9)10/h1-4,9-10H
1.00E+4n/an/an/an/an/an/an/an/a
TBA
Curated by ChEMBL
Assay Description
Competitive inhibition of Subtilisin BL wild type enzyme from B. lentus
Bioorg Med Chem Lett 6: 2501-2506 (1996)
Article DOI: 10.1016/0960-894X(96)00466-0
BindingDB Entry DOI: 10.7270/Q2X34XFJ
Carbonic anhydrase 1
(Homo sapiens (Human))
BDBM50067892
(4-Bromophenyl-boronic acid | 4-bromo phenyl boroni...)
Show SMILES OB(O)c1ccc(Br)cc1
Show InChI InChI=1S/C6H6BBrO2/c8-6-3-1-5(2-4-6)7(9)10/h1-4,9-10H
NCI pathway
Reactome pathway
1.17E+4n/an/an/an/an/an/an/an/a
Universit£ degli Studi di Firenze
Curated by ChEMBL
Assay Description
Inhibition of human recombinant cytosolic carbonic anhydrase 1 preincubated for 15 mins by CO2 hydration stopped-flow assay
Bioorg Med Chem Lett 19: 2642-5 (2009)
Article DOI: 10.1016/j.bmcl.2009.03.147
BindingDB Entry DOI: 10.7270/Q27D2V4T
Carbonic anhydrase
(Candida albicans (Yeast))
BDBM50067892
(4-Bromophenyl-boronic acid | 4-bromo phenyl boroni...)
Show SMILES OB(O)c1ccc(Br)cc1
Show InChI InChI=1S/C6H6BBrO2/c8-6-3-1-5(2-4-6)7(9)10/h1-4,9-10H
1.59E+4n/an/an/an/an/an/an/an/a
Universit£ degli Studi di Firenze
Curated by ChEMBL
Assay Description
Inhibition of Candida albicans recombinant Carbonic anhydrase preincubated for 15 mins by CO2 hydration stopped-flow assay
Bioorg Med Chem Lett 19: 2642-5 (2009)
Article DOI: 10.1016/j.bmcl.2009.03.147
BindingDB Entry DOI: 10.7270/Q27D2V4T
Subtilisin BL
(Bacillus lentus)
BDBM50067892
(4-Bromophenyl-boronic acid | 4-bromo phenyl boroni...)
Show SMILES OB(O)c1ccc(Br)cc1
Show InChI InChI=1S/C6H6BBrO2/c8-6-3-1-5(2-4-6)7(9)10/h1-4,9-10H
2.30E+4n/an/an/an/an/an/an/an/a
TBA
Curated by ChEMBL
Assay Description
Competitive inhibition of Subtilisin BL M222C-mutated enzyme from B. lentus
Bioorg Med Chem Lett 6: 2501-2506 (1996)
Article DOI: 10.1016/0960-894X(96)00466-0
BindingDB Entry DOI: 10.7270/Q2X34XFJ
Subtilisin BL
(Bacillus lentus)
BDBM50067892
(4-Bromophenyl-boronic acid | 4-bromo phenyl boroni...)
Show SMILES OB(O)c1ccc(Br)cc1
Show InChI InChI=1S/C6H6BBrO2/c8-6-3-1-5(2-4-6)7(9)10/h1-4,9-10H
2.30E+4n/an/an/an/an/an/an/an/a
TBA
Curated by ChEMBL
Assay Description
Competitive inhibition of Subtilisin BL wild type enzyme from B. lentus
Bioorg Med Chem Lett 6: 2501-2506 (1996)
Article DOI: 10.1016/0960-894X(96)00466-0
BindingDB Entry DOI: 10.7270/Q2X34XFJ
Subtilisin Carlsberg
(Bacillus licheniformis)
BDBM50067892
(4-Bromophenyl-boronic acid | 4-bromo phenyl boroni...)
Show SMILES OB(O)c1ccc(Br)cc1
Show InChI InChI=1S/C6H6BBrO2/c8-6-3-1-5(2-4-6)7(9)10/h1-4,9-10H
2.30E+4n/an/an/an/an/an/an/an/a
TBA
Curated by ChEMBL
Assay Description
Competitive inhibition of Subtilisin Carlsberg enzyme from B. lentus
Bioorg Med Chem Lett 6: 2501-2506 (1996)
Article DOI: 10.1016/0960-894X(96)00466-0
BindingDB Entry DOI: 10.7270/Q2X34XFJ
Beta-lactamase TEM
(Escherichia coli)
BDBM50067892
(4-Bromophenyl-boronic acid | 4-bromo phenyl boroni...)
Show SMILES OB(O)c1ccc(Br)cc1
Show InChI InChI=1S/C6H6BBrO2/c8-6-3-1-5(2-4-6)7(9)10/h1-4,9-10H
2.80E+4n/an/an/an/an/an/an/an/a
TBA
Curated by ChEMBL
Assay Description
Inhibitory constant was determined against class A RTEM-1 Beta-lactamase from Escherichia coli
Bioorg Med Chem Lett 4: 1229-1234 (1994)
Article DOI: 10.1016/S0960-894X(01)80336-X
BindingDB Entry DOI: 10.7270/Q2W9595N
Urease
(Glycine max (Soybean))
BDBM50067892
(4-Bromophenyl-boronic acid | 4-bromo phenyl boroni...)
Show SMILES OB(O)c1ccc(Br)cc1
Show InChI InChI=1S/C6H6BBrO2/c8-6-3-1-5(2-4-6)7(9)10/h1-4,9-10H
2.20E+5 -5.19n/an/an/an/an/a7.037
Banaras Hindu University
Assay Description
The inhibition studies of soybean urease were initiated with boric acid and boronic acids (butylboronic acid, 4-bromophenylboronic acid, and phenylbo...
J Enzyme Inhib Med Chem 25: 646-52 (2010)
Article DOI: 10.3109/14756360903468155
BindingDB Entry DOI: 10.7270/Q2F18XM8