BDBM50067933 5-(((2S,3S)-2-(3,5-bis(trifluoromethyl)benzyloxy)-3-(4-fluorophenyl)morpholino)methyl)-2H-1,2,4-triazol-3(4H)-one::5-[(2S,3S)-2-(3,5-Bis-trifluoromethyl-benzyloxy)-3-(4-fluoro-phenyl)-morpholin-4-ylmethyl]-2,4-dihydro-[1,2,4]triazol-3-one::CHEMBL140745
SMILES: Fc1ccc(cc1)[C@H]1[C@@H](OCc2cc(cc(c2)C(F)(F)F)C(F)(F)F)OCCN1Cc1n[nH]c(=O)[nH]1
InChI Key: InChIKey=FYADPUQVZFJTEM-RBUKOAKNSA-N
Data: 2 IC50
Activity Spreadsheet -- Enzyme Inhibition Constant Data from BindingDB
Found 2 hits for monomerid = 50067933
Trg + Lig
Ki
nM
ΔG°
kcal/mole
IC50
nM
Kd
nM
EC50/IC50
nM
koff
s-1
kon
M-1s-1
pHTemp
°C
Neurokinin 1 receptor
(Homo sapiens (Human))
BDBM50067933
(5-(((2S,3S)-2-(3,5-bis(trifluoromethyl)benzyloxy)-...)
Show SMILES Fc1ccc(cc1)[C@H]1[C@@H](OCc2cc(cc(c2)C(F)(F)F)C(F)(F)F)OCCN1Cc1n[nH]c(=O)[nH]1 |r|
Show InChI InChI=1S/C22H19F7N4O3/c23-16-3-1-13(2-4-16)18-19(35-6-5-33(18)10-17-30-20(34)32-31-17)36-11-12-7-14(21(24,25)26)9-15(8-12)22(27,28)29/h1-4,7-9,18-19H,5-6,10-11H2,(H2,30,31,32,34)/t18-,19+/m0/s1
Reactome pathway
n/an/a 0.0700n/an/an/an/an/an/a
Merck Research Laboratories
Curated by ChEMBL
Assay Description
Inhibition of NK1 receptor (unknown origin)
J Med Chem 51: 4359-69 (2008)
Article DOI: 10.1021/jm800219f
BindingDB Entry DOI: 10.7270/Q28915N5
Neurokinin 1 receptor
(Homo sapiens (Human))
BDBM50067933
(5-(((2S,3S)-2-(3,5-bis(trifluoromethyl)benzyloxy)-...)
Show SMILES Fc1ccc(cc1)[C@H]1[C@@H](OCc2cc(cc(c2)C(F)(F)F)C(F)(F)F)OCCN1Cc1n[nH]c(=O)[nH]1 |r|
Show InChI InChI=1S/C22H19F7N4O3/c23-16-3-1-13(2-4-16)18-19(35-6-5-33(18)10-17-30-20(34)32-31-17)36-11-12-7-14(21(24,25)26)9-15(8-12)22(27,28)29/h1-4,7-9,18-19H,5-6,10-11H2,(H2,30,31,32,34)/t18-,19+/m0/s1
Reactome pathway
n/an/a 0.0700n/an/an/an/an/an/a
Merck Research Laboratories
Curated by ChEMBL
Assay Description
Displacement of [125I]-labeled SP from the human Tachykinin receptor 1 expressed in CHO cells
J Med Chem 41: 4607-14 (1998)
Article DOI: 10.1021/jm980299k
BindingDB Entry DOI: 10.7270/Q2XW4HZ7