BDBM50068226 CHEMBL1607835
SMILES: Cc1ccc(cc1)S(=O)(=O)NCCc1ccc(cc1)S(N)(=O)=O
InChI Key: InChIKey=YLZSJBGBKOINMC-UHFFFAOYSA-N
Data: 1 KI  3 IC50
Activity Spreadsheet -- Enzyme Inhibition Constant Data from BindingDB
Found 4 hits for monomerid = 50068226
Trg + Lig
Ki
nM
ΔG°
kcal/mole
IC50
nM
Kd
nM
EC50/IC50
nM
koff
s-1
kon
M-1s-1
pHTemp
°C
Tissue non-specific alkaline phosphatase (TNAP)
(Bos taurus (Cattle))
BDBM50068226
(CHEMBL1607835)
Show SMILES Cc1ccc(cc1)S(=O)(=O)NCCc1ccc(cc1)S(N)(=O)=O
Show InChI InChI=1S/C15H18N2O4S2/c1-12-2-6-15(7-3-12)23(20,21)17-11-10-13-4-8-14(9-5-13)22(16,18)19/h2-9,17H,10-11H2,1H3,(H2,16,18,19)
1.76E+4n/an/an/an/an/an/an/an/a
Forman Christian College (A Chartered University)
Curated by ChEMBL
Assay Description
Inhibition of bovine kidney non-specific alkaline phosphatase using CDP-star chemiluminescent substrate assessed as change in luminescence by spectro...
Bioorg Med Chem 23: 2435-44 (2015)
Article DOI: 10.1016/j.bmc.2015.03.054
BindingDB Entry DOI: 10.7270/Q2WW7KC8
Carbonic anhydrase
(Bos taurus)
BDBM50068226
(CHEMBL1607835)
Show SMILES Cc1ccc(cc1)S(=O)(=O)NCCc1ccc(cc1)S(N)(=O)=O
Show InChI InChI=1S/C15H18N2O4S2/c1-12-2-6-15(7-3-12)23(20,21)17-11-10-13-4-8-14(9-5-13)22(16,18)19/h2-9,17H,10-11H2,1H3,(H2,16,18,19)
n/an/a 241n/an/an/an/an/an/a
Forman Christian College (A Chartered University)
Curated by ChEMBL
Assay Description
Inhibition of bovine carbonic anhydrase 2 assessed as hydrolysis of p-nitrophenyl acetate after 30 mins by spectrophotometric method
Bioorg Med Chem 23: 2435-44 (2015)
Article DOI: 10.1016/j.bmc.2015.03.054
BindingDB Entry DOI: 10.7270/Q2WW7KC8
Intestinal alkaline phosphatase (IAP)
(Bos taurus (Cattle))
BDBM50068226
(CHEMBL1607835)
Show SMILES Cc1ccc(cc1)S(=O)(=O)NCCc1ccc(cc1)S(N)(=O)=O
Show InChI InChI=1S/C15H18N2O4S2/c1-12-2-6-15(7-3-12)23(20,21)17-11-10-13-4-8-14(9-5-13)22(16,18)19/h2-9,17H,10-11H2,1H3,(H2,16,18,19)
n/an/a 2.96E+3n/an/an/an/an/an/a
Forman Christian College (A Chartered University)
Curated by ChEMBL
Assay Description
Inhibition of calf intestinal alkaline phosphatase using CDP-star chemiluminescent substrate assessed as change in luminescence by spectrophotometric...
Bioorg Med Chem 23: 2435-44 (2015)
Article DOI: 10.1016/j.bmc.2015.03.054
BindingDB Entry DOI: 10.7270/Q2WW7KC8
Tissue non-specific alkaline phosphatase (TNAP)
(Bos taurus (Cattle))
BDBM50068226
(CHEMBL1607835)
Show SMILES Cc1ccc(cc1)S(=O)(=O)NCCc1ccc(cc1)S(N)(=O)=O
Show InChI InChI=1S/C15H18N2O4S2/c1-12-2-6-15(7-3-12)23(20,21)17-11-10-13-4-8-14(9-5-13)22(16,18)19/h2-9,17H,10-11H2,1H3,(H2,16,18,19)
n/an/a 4.12E+4n/an/an/an/an/an/a
Forman Christian College (A Chartered University)
Curated by ChEMBL
Assay Description
Inhibition of bovine kidney non-specific alkaline phosphatase using CDP-star chemiluminescent substrate assessed as change in luminescence by spectro...
Bioorg Med Chem 23: 2435-44 (2015)
Article DOI: 10.1016/j.bmc.2015.03.054
BindingDB Entry DOI: 10.7270/Q2WW7KC8