BDBM50069129 CHEMBL3403523
SMILES: NC(=N)Nc1ccc(cc1)C(=O)Oc1cccc(c1)[N+]([O-])=O
InChI Key: InChIKey=LIJHCOQWUYPXSK-UHFFFAOYSA-N
Data: 1 IC50
Activity Spreadsheet -- Enzyme Inhibition Constant Data from BindingDB
Found 1 hit for monomerid = 50069129
Trg + Lig
Ki
nM
ΔG°
kcal/mole
IC50
nM
Kd
nM
EC50/IC50
nM
koff
s-1
kon
M-1s-1
pHTemp
°C
Hepatocyte growth factor activator
(Homo sapiens (Human))
BDBM50069129
(CHEMBL3403523)
Show SMILES NC(=N)Nc1ccc(cc1)C(=O)Oc1cccc(c1)[N+]([O-])=O
Show InChI InChI=1S/C14H12N4O4/c15-14(16)17-10-6-4-9(5-7-10)13(19)22-12-3-1-2-11(8-12)18(20)21/h1-8H,(H4,15,16,17)
n/an/a 3.00E+3n/an/an/an/an/an/a
Washington University School of Medicine
Curated by ChEMBL
Assay Description
Inhibition of recombinant N-terminal His-tagged HGFA (unknown origin) expressed in baculovirus-infected Sf9 cells incubated for 30 mins prior to crom...
Bioorg Med Chem 23: 2328-43 (2015)
Article DOI: 10.1016/j.bmc.2015.03.072
BindingDB Entry DOI: 10.7270/Q23F4RB4