BDBM50069131 CHEMBL3403522
SMILES: NC(=N)Nc1ccc(cc1)C(=O)Oc1ccc(cc1)C(N)=O
InChI Key: InChIKey=QFKUAWGKUZXVPH-UHFFFAOYSA-N
Data: 1 IC50
Activity Spreadsheet -- Enzyme Inhibition Constant Data from BindingDB
Found 1 hit for monomerid = 50069131
Trg + Lig
Ki
nM
ΔG°
kcal/mole
IC50
nM
Kd
nM
EC50/IC50
nM
koff
s-1
kon
M-1s-1
pHTemp
°C
Hepatocyte growth factor activator
(Homo sapiens (Human))
BDBM50069131
(CHEMBL3403522)
Show SMILES NC(=N)Nc1ccc(cc1)C(=O)Oc1ccc(cc1)C(N)=O
Show InChI InChI=1S/C15H14N4O3/c16-13(20)9-3-7-12(8-4-9)22-14(21)10-1-5-11(6-2-10)19-15(17)18/h1-8H,(H2,16,20)(H4,17,18,19)
n/an/a 6.80E+3n/an/an/an/an/an/a
Washington University School of Medicine
Curated by ChEMBL
Assay Description
Inhibition of recombinant N-terminal His-tagged HGFA (unknown origin) expressed in baculovirus-infected Sf9 cells incubated for 30 mins prior to crom...
Bioorg Med Chem 23: 2328-43 (2015)
Article DOI: 10.1016/j.bmc.2015.03.072
BindingDB Entry DOI: 10.7270/Q23F4RB4