BDBM50069286 5-Chloro-4-ethylamino-N-(1-ethyl-4-methyl-[1,4]diazepan-6-yl)-2-methoxy-benzamide::CHEMBL157784
SMILES: CCNc1cc(OC)c(cc1Cl)C(=O)NC1CN(C)CCN(CC)C1
InChI Key: InChIKey=ZXIGYXVBZYGZFG-UHFFFAOYSA-N
Data: 2 IC50
Activity Spreadsheet -- Enzyme Inhibition Constant Data from BindingDB
Found 2 hits for monomerid = 50069286
Trg + Lig
Ki
nM
ΔG°
kcal/mole
IC50
nM
Kd
nM
EC50/IC50
nM
koff
s-1
kon
M-1s-1
pHTemp
°C
Serotonin 3a (5-HT3a)/3b (5-HT3b) receptor
(Rattus norvegicus-RAT)
BDBM50069286
(5-Chloro-4-ethylamino-N-(1-ethyl-4-methyl-[1,4]dia...)
Show SMILES CCNc1cc(OC)c(cc1Cl)C(=O)NC1CN(C)CCN(CC)C1
Show InChI InChI=1S/C18H29ClN4O2/c1-5-20-16-10-17(25-4)14(9-15(16)19)18(24)21-13-11-22(3)7-8-23(6-2)12-13/h9-10,13,20H,5-8,11-12H2,1-4H3,(H,21,24)
n/an/a 1.90n/an/an/an/an/an/a
Dainippon Pharmaceutical Co., Ltd.
Curated by ChEMBL
Assay Description
Binding affinity against 5-hydroxytryptamine 3 receptor in rat cortical membrane using [3H]GR-65630 as radioligand
Bioorg Med Chem Lett 8: 619-24 (1999)
BindingDB Entry DOI: 10.7270/Q25Q4WN6
D(2) dopamine receptor
(Rattus norvegicus (rat))
BDBM50069286
(5-Chloro-4-ethylamino-N-(1-ethyl-4-methyl-[1,4]dia...)
Show SMILES CCNc1cc(OC)c(cc1Cl)C(=O)NC1CN(C)CCN(CC)C1
Show InChI InChI=1S/C18H29ClN4O2/c1-5-20-16-10-17(25-4)14(9-15(16)19)18(24)21-13-11-22(3)7-8-23(6-2)12-13/h9-10,13,20H,5-8,11-12H2,1-4H3,(H,21,24)
Reactome pathway
n/an/a 181n/an/an/an/an/an/a
Dainippon Pharmaceutical Co., Ltd.
Curated by ChEMBL
Assay Description
Binding affinity against dopamine D2 receptor in rat brain synaptic membrane using [3H]-spiperone as radioligand
Bioorg Med Chem Lett 8: 619-24 (1999)
BindingDB Entry DOI: 10.7270/Q25Q4WN6