BDBM50069309 CHEMBL3402471
SMILES: OCCOc1cc(ccc1NC(=O)N(CCO)Cc1ccccc1)-c1cn[nH]c1
InChI Key: InChIKey=WPQHWJHRGINSJT-UHFFFAOYSA-N
Data: 1 IC50
Activity Spreadsheet -- Enzyme Inhibition Constant Data from BindingDB
Found 1 hit for monomerid = 50069309
Trg + Lig
Ki
nM
ΔG°
kcal/mole
IC50
nM
Kd
nM
EC50/IC50
nM
koff
s-1
kon
M-1s-1
pHTemp
°C
Rho-associated protein kinase 2
(Homo sapiens (Human))
BDBM50069309
(CHEMBL3402471)
Show SMILES OCCOc1cc(ccc1NC(=O)N(CCO)Cc1ccccc1)-c1cn[nH]c1
Show InChI InChI=1S/C21H24N4O4/c26-9-8-25(15-16-4-2-1-3-5-16)21(28)24-19-7-6-17(18-13-22-23-14-18)12-20(19)29-11-10-27/h1-7,12-14,26-27H,8-11,15H2,(H,22,23)(H,24,28)
n/an/a<1n/an/an/an/an/an/a
Shanghai Institute of Technology
Curated by ChEMBL
Assay Description
Inhibition of ROCK2 (unknown origin) using STK2 substrate after 4 hrs by HTRF mode
Bioorg Med Chem 23: 2505-17 (2015)
Article DOI: 10.1016/j.bmc.2015.03.047
BindingDB Entry DOI: 10.7270/Q2ZP47SX