BDBM50069606 (2R,3S)-2-Benzylsulfanylmethyl-N*1*-hydroxy-3-isobutyl-N*4*-((S)-1-methylcarbamoyl-2-phenyl-ethyl)-succinamide::CHEMBL115211
SMILES: CNC(=O)[C@H](Cc1ccccc1)NC(=O)[C@H](CC(C)C)[C@H](CSCc1ccccc1)C(=O)NO
InChI Key: InChIKey=PKGJPJPGFGLRRN-VJBWXMMDSA-N
Data: 2 IC50
Activity Spreadsheet -- Enzyme Inhibition Constant Data from BindingDB
Found 2 hits for monomerid = 50069606
Trg + Lig
Ki
nM
ΔG°
kcal/mole
IC50
nM
Kd
nM
EC50/IC50
nM
koff
s-1
kon
M-1s-1
pHTemp
°C
Interstitial collagenase
(Homo sapiens (Human))
BDBM50069606
((2R,3S)-2-Benzylsulfanylmethyl-N*1*-hydroxy-3-isob...)
Show SMILES CNC(=O)[C@H](Cc1ccccc1)NC(=O)[C@H](CC(C)C)[C@H](CSCc1ccccc1)C(=O)NO
Show InChI InChI=1S/C26H35N3O4S/c1-18(2)14-21(22(25(31)29-33)17-34-16-20-12-8-5-9-13-20)24(30)28-23(26(32)27-3)15-19-10-6-4-7-11-19/h4-13,18,21-23,33H,14-17H2,1-3H3,(H,27,32)(H,28,30)(H,29,31)/t21-,22+,23+/m1/s1
Reactome pathway
n/an/a 25n/an/an/an/an/an/a
SmithKline Beecham Pharmaceuticals
Curated by ChEMBL
Assay Description
Inhibitory activity of the compound towards human recombinant fibroblast collagenase
Bioorg Med Chem Lett 8: 29-34 (1999)
BindingDB Entry DOI: 10.7270/Q2TT4Q3W
Immunoglobulin epsilon Fc receptor
(Homo sapiens (Human))
BDBM50069606
((2R,3S)-2-Benzylsulfanylmethyl-N*1*-hydroxy-3-isob...)
Show SMILES CNC(=O)[C@H](Cc1ccccc1)NC(=O)[C@H](CC(C)C)[C@H](CSCc1ccccc1)C(=O)NO
Show InChI InChI=1S/C26H35N3O4S/c1-18(2)14-21(22(25(31)29-33)17-34-16-20-12-8-5-9-13-20)24(30)28-23(26(32)27-3)15-19-10-6-4-7-11-19/h4-13,18,21-23,33H,14-17H2,1-3H3,(H,27,32)(H,28,30)(H,29,31)/t21-,22+,23+/m1/s1
NCI pathway
Reactome pathway
n/an/a 30n/an/an/an/an/an/a
SmithKline Beecham Pharmaceuticals
Curated by ChEMBL
Assay Description
Tested for inhibition against CD23 (IgE receptor) proteolysis in membranes derived from RPM18866 cells ( a human B-cell line); value ranges from 30-1...
Bioorg Med Chem Lett 8: 29-34 (1999)
BindingDB Entry DOI: 10.7270/Q2TT4Q3W