BDBM50069765 CHEMBL3407551
SMILES: OCCc1cc(c(Sc2cccc(Cl)c2Cl)s1)[N+]([O-])=O
InChI Key: InChIKey=OQWVOKXGYKYRGA-UHFFFAOYSA-N
Data: 1 EC50
Activity Spreadsheet -- Enzyme Inhibition Constant Data from BindingDB
Found 1 hit for monomerid = 50069765
Trg + Lig
Ki
nM
ΔG°
kcal/mole
IC50
nM
Kd
nM
EC50/IC50
nM
koff
s-1
kon
M-1s-1
pHTemp
°C
Ubiquitin carboxyl-terminal hydrolase 7
(Homo sapiens (Human))
BDBM50069765
(CHEMBL3407551)
Show SMILES OCCc1cc(c(Sc2cccc(Cl)c2Cl)s1)[N+]([O-])=O
Show InChI InChI=1S/C12H9Cl2NO3S2/c13-8-2-1-3-10(11(8)14)20-12-9(15(17)18)6-7(19-12)4-5-16/h1-3,6,16H,4-5H2
n/an/an/an/a 2.01E+4n/an/an/an/a
Genentech
Curated by ChEMBL
Assay Description
Inhibition of USP7 in multiple myeloma cells (unknown origin) by immunohistochemistry
J Med Chem 58: 1581-95 (2015)
Article DOI: 10.1021/jm501061a
BindingDB Entry DOI: 10.7270/Q29025GH