BDBM50069794 CHEMBL3407560
SMILES: CC(C)(C)S(=O)(=O)C[C@H](C1CC1)N1[C@@H]([C@H](C[C@](C)(CC(=O)Nc2cccc(c2)C(O)=O)C1=O)c1cccc(Cl)c1)c1ccc(Cl)cc1
InChI Key: InChIKey=POIFJRXIXHGFLD-RVDHBOFVSA-N
Data: 1 IC50
Activity Spreadsheet -- Enzyme Inhibition Constant Data from BindingDB
Found 1 hit for monomerid = 50069794
Trg + Lig
Ki
nM
ΔG°
kcal/mole
IC50
nM
Kd
nM
EC50/IC50
nM
koff
s-1
kon
M-1s-1
pHTemp
°C
MDM2-MDMX
(Homo sapiens (Human))
BDBM50069794
(CHEMBL3407560)
Show SMILES CC(C)(C)S(=O)(=O)C[C@H](C1CC1)N1[C@@H]([C@H](C[C@](C)(CC(=O)Nc2cccc(c2)C(O)=O)C1=O)c1cccc(Cl)c1)c1ccc(Cl)cc1 |r|
Show InChI InChI=1S/C36H40Cl2N2O6S/c1-35(2,3)47(45,46)21-30(22-11-12-22)40-32(23-13-15-26(37)16-14-23)29(24-7-5-9-27(38)17-24)19-36(4,34(40)44)20-31(41)39-28-10-6-8-25(18-28)33(42)43/h5-10,13-18,22,29-30,32H,11-12,19-21H2,1-4H3,(H,39,41)(H,42,43)/t29-,30-,32-,36-/m1/s1
NCI pathway
Reactome pathway
n/an/a 0.210n/an/an/an/an/an/a
Amgen Inc.
Curated by ChEMBL
Assay Description
Binding affinity to human GST-thrombin-tagged MDM2 ( 1 to 188 aa) assessed as inhibition of interaction with human p53 preincubated with compound for...
J Med Chem 57: 10499-511 (2014)
Article DOI: 10.1021/jm501550p
BindingDB Entry DOI: 10.7270/Q2571DPW