BDBM50069797 CHEMBL3407556
SMILES: CC(C)(C)S(=O)(=O)C[C@H](C1CC1)N1[C@@H]([C@H](C[C@](C)(CC(=O)Nc2ccccc2)C1=O)c1cccc(Cl)c1)c1ccc(Cl)cc1
InChI Key: InChIKey=LXLAALURXKPNDV-KMXUMHSJSA-N
Data: 1 IC50
Activity Spreadsheet -- Enzyme Inhibition Constant Data from BindingDB
Found 1 hit for monomerid = 50069797
Trg + Lig
Ki
nM
ΔG°
kcal/mole
IC50
nM
Kd
nM
EC50/IC50
nM
koff
s-1
kon
M-1s-1
pHTemp
°C
MDM2-MDMX
(Homo sapiens (Human))
BDBM50069797
(CHEMBL3407556)
Show SMILES CC(C)(C)S(=O)(=O)C[C@H](C1CC1)N1[C@@H]([C@H](C[C@](C)(CC(=O)Nc2ccccc2)C1=O)c1cccc(Cl)c1)c1ccc(Cl)cc1 |r|
Show InChI InChI=1S/C35H40Cl2N2O4S/c1-34(2,3)44(42,43)22-30(23-13-14-23)39-32(24-15-17-26(36)18-16-24)29(25-9-8-10-27(37)19-25)20-35(4,33(39)41)21-31(40)38-28-11-6-5-7-12-28/h5-12,15-19,23,29-30,32H,13-14,20-22H2,1-4H3,(H,38,40)/t29-,30-,32-,35-/m1/s1
NCI pathway
Reactome pathway
n/an/a 0.370n/an/an/an/an/an/a
Amgen Inc.
Curated by ChEMBL
Assay Description
Binding affinity to human GST-thrombin-tagged MDM2 ( 1 to 188 aa) assessed as inhibition of interaction with human p53 preincubated with compound for...
J Med Chem 57: 10499-511 (2014)
Article DOI: 10.1021/jm501550p
BindingDB Entry DOI: 10.7270/Q2571DPW