null
SMILES: COc1ccc(COc2ccc3[nH]c(CN(C)CC#C)cc3c2)c2cccnc12
InChI Key: InChIKey=JDGRGCUQPOZBJB-UHFFFAOYSA-N
Activity Spreadsheet -- Enzyme Inhibition Constant Data from BindingDB
Found 2 hits for monomerid = 50069810
Trg + Lig
Ki
nM
ΔG°
kcal/mole
IC50
nM
Kd
nM
EC50/IC50
nM
koff
s-1
kon
M-1s-1
pHTemp
°C
Amine oxidase [flavin-containing] A
(Homo sapiens (Human))
BDBM50069810
(CHEMBL3407589)
Show SMILES COc1ccc(COc2ccc3[nH]c(CN(C)CC#C)cc3c2)c2cccnc12
Show InChI InChI=1S/C24H23N3O2/c1-4-12-27(2)15-19-13-18-14-20(8-9-22(18)26-19)29-16-17-7-10-23(28-3)24-21(17)6-5-11-25-24/h1,5-11,13-14,26H,12,15-16H2,2-3H3
n/an/a 6.30E+5n/an/an/an/an/an/a
Laboratorio de Qu�mica M�dica, (IQOG, CSIC)
Curated by ChEMBL
Assay Description
Inhibition of human MAO-A expressed in baculovirus infected BTI insect cells preincubated for 15 mins
J Med Chem 57: 10455-63 (2014)
Article DOI: 10.1021/jm501501a
BindingDB Entry DOI: 10.7270/Q2WS8VX3
Amine oxidase [flavin-containing] B
(Homo sapiens (Human))
BDBM50069810
(CHEMBL3407589)
Show SMILES COc1ccc(COc2ccc3[nH]c(CN(C)CC#C)cc3c2)c2cccnc12
Show InChI InChI=1S/C24H23N3O2/c1-4-12-27(2)15-19-13-18-14-20(8-9-22(18)26-19)29-16-17-7-10-23(28-3)24-21(17)6-5-11-25-24/h1,5-11,13-14,26H,12,15-16H2,2-3H3
n/an/a 1.65E+5n/an/an/an/an/an/a
Laboratorio de Qu�mica M�dica, (IQOG, CSIC)
Curated by ChEMBL
Assay Description
Inhibition of human MAO-B expressed in baculovirus infected BTI insect cells preincubated for 15 mins
J Med Chem 57: 10455-63 (2014)
Article DOI: 10.1021/jm501501a
BindingDB Entry DOI: 10.7270/Q2WS8VX3