BDBM50069870 (2-Ethoxy-5-trifluoromethoxy-benzyl)-((2S,3S)-2-phenyl-piperidin-3-yl)-amine::CHEMBL94328
SMILES: CCOc1ccc(OC(F)(F)F)cc1CN[C@H]1CCCN[C@H]1c1ccccc1
InChI Key: InChIKey=ZPQUTMAPZMKLCT-ICSRJNTNSA-N
Data: 1 IC50
Activity Spreadsheet -- Enzyme Inhibition Constant Data from BindingDB
Found 1 hit for monomerid = 50069870
Trg + Lig
Ki
nM
ΔG°
kcal/mole
IC50
nM
Kd
nM
EC50/IC50
nM
koff
s-1
kon
M-1s-1
pHTemp
°C
Neurokinin 1 receptor
(Homo sapiens (Human))
BDBM50069870
((2-Ethoxy-5-trifluoromethoxy-benzyl)-((2S,3S)-2-ph...)
Show SMILES CCOc1ccc(OC(F)(F)F)cc1CN[C@H]1CCCN[C@H]1c1ccccc1
Show InChI InChI=1S/C21H25F3N2O2/c1-2-27-19-11-10-17(28-21(22,23)24)13-16(19)14-26-18-9-6-12-25-20(18)15-7-4-3-5-8-15/h3-5,7-8,10-11,13,18,20,25-26H,2,6,9,12,14H2,1H3/t18-,20-/m0/s1
Reactome pathway
n/an/a 0.140n/an/an/an/an/an/a
Pfizer Inc.
Curated by ChEMBL
Assay Description
Antagonist activity for Tachykinin receptor 1 as displacement of [3H]-Substance P in human IM-9 cells
Bioorg Med Chem Lett 8: 281-4 (1999)
BindingDB Entry DOI: 10.7270/Q2Z60PK8