BDBM50070031 CHEMBL3125089
SMILES: CC(C)C[C@H](N)C(=O)N[C@@H](CO)C(=O)N[C@@H](CS)C(=O)N[C@H](CCC(N)=O)C(=O)N[C@@H](CC(C)C)C(=O)N[C@@H](Cc1ccc(O)cc1)C(=O)N[C@@H](CCC(N)=O)C(=O)N[C@@H](CCCNC(N)=N)C(O)=O
InChI Key: InChIKey=SWZUPEQPZWJDHL-DKDARUJGSA-N
Data: 5 IC50
Activity Spreadsheet -- Enzyme Inhibition Constant Data from BindingDB
Found 5 hits for monomerid = 50070031
Trg + Lig
Ki
nM
ΔG°
kcal/mole
IC50
nM
Kd
nM
EC50/IC50
nM
koff
s-1
kon
M-1s-1
pHTemp
°C
Thymidylate synthase
(Homo sapiens (Human))
BDBM50070031
(CHEMBL3125089)
Show SMILES CC(C)C[C@H](N)C(=O)N[C@@H](CO)C(=O)N[C@@H](CS)C(=O)N[C@H](CCC(N)=O)C(=O)N[C@@H](CC(C)C)C(=O)N[C@@H](Cc1ccc(O)cc1)C(=O)N[C@@H](CCC(N)=O)C(=O)N[C@@H](CCCNC(N)=N)C(O)=O |r|
Show InChI InChI=1S/C43H71N13O13S/c1-21(2)16-25(44)35(61)55-31(19-57)40(66)56-32(20-70)41(67)51-27(12-14-34(46)60)37(63)53-29(17-22(3)4)38(64)54-30(18-23-7-9-24(58)10-8-23)39(65)50-26(11-13-33(45)59)36(62)52-28(42(68)69)6-5-15-49-43(47)48/h7-10,21-22,25-32,57-58,70H,5-6,11-20,44H2,1-4H3,(H2,45,59)(H2,46,60)(H,50,65)(H,51,67)(H,52,62)(H,53,63)(H,54,64)(H,55,61)(H,56,66)(H,68,69)(H4,47,48,49)/t25-,26-,27+,28-,29-,30-,31-,32-/m0/s1
NCI pathway
Reactome pathway
n/an/a 6.80E+4n/an/an/an/an/an/a
University of California-San Francisco
Curated by ChEMBL
Assay Description
Inhibition of wild-type His-tagged human thymidylate synthase after 1 hr by UV-visible spectrophotometry
J Med Chem 58: 1012-8 (2015)
Article DOI: 10.1021/jm5011176
BindingDB Entry DOI: 10.7270/Q2N87CH6
Thymidylate synthase
(Homo sapiens (Human))
BDBM50070031
(CHEMBL3125089)
Show SMILES CC(C)C[C@H](N)C(=O)N[C@@H](CO)C(=O)N[C@@H](CS)C(=O)N[C@H](CCC(N)=O)C(=O)N[C@@H](CC(C)C)C(=O)N[C@@H](Cc1ccc(O)cc1)C(=O)N[C@@H](CCC(N)=O)C(=O)N[C@@H](CCCNC(N)=N)C(O)=O |r|
Show InChI InChI=1S/C43H71N13O13S/c1-21(2)16-25(44)35(61)55-31(19-57)40(66)56-32(20-70)41(67)51-27(12-14-34(46)60)37(63)53-29(17-22(3)4)38(64)54-30(18-23-7-9-24(58)10-8-23)39(65)50-26(11-13-33(45)59)36(62)52-28(42(68)69)6-5-15-49-43(47)48/h7-10,21-22,25-32,57-58,70H,5-6,11-20,44H2,1-4H3,(H2,45,59)(H2,46,60)(H,50,65)(H,51,67)(H,52,62)(H,53,63)(H,54,64)(H,55,61)(H,56,66)(H,68,69)(H4,47,48,49)/t25-,26-,27+,28-,29-,30-,31-,32-/m0/s1
NCI pathway
Reactome pathway
n/an/a 1.52E+5n/an/an/an/an/an/a
University of California-San Francisco
Curated by ChEMBL
Assay Description
Inhibition of His-tagged human thymidylate synthase K47A mutant after 1 hr by UV-visible spectrophotometry
J Med Chem 58: 1012-8 (2015)
Article DOI: 10.1021/jm5011176
BindingDB Entry DOI: 10.7270/Q2N87CH6
Thymidylate synthase
(Homo sapiens (Human))
BDBM50070031
(CHEMBL3125089)
Show SMILES CC(C)C[C@H](N)C(=O)N[C@@H](CO)C(=O)N[C@@H](CS)C(=O)N[C@H](CCC(N)=O)C(=O)N[C@@H](CC(C)C)C(=O)N[C@@H](Cc1ccc(O)cc1)C(=O)N[C@@H](CCC(N)=O)C(=O)N[C@@H](CCCNC(N)=N)C(O)=O |r|
Show InChI InChI=1S/C43H71N13O13S/c1-21(2)16-25(44)35(61)55-31(19-57)40(66)56-32(20-70)41(67)51-27(12-14-34(46)60)37(63)53-29(17-22(3)4)38(64)54-30(18-23-7-9-24(58)10-8-23)39(65)50-26(11-13-33(45)59)36(62)52-28(42(68)69)6-5-15-49-43(47)48/h7-10,21-22,25-32,57-58,70H,5-6,11-20,44H2,1-4H3,(H2,45,59)(H2,46,60)(H,50,65)(H,51,67)(H,52,62)(H,53,63)(H,54,64)(H,55,61)(H,56,66)(H,68,69)(H4,47,48,49)/t25-,26-,27+,28-,29-,30-,31-,32-/m0/s1
NCI pathway
Reactome pathway
n/an/a 3.00E+5n/an/an/an/an/an/a
University of California-San Francisco
Curated by ChEMBL
Assay Description
Inhibition of His-tagged human thymidylate synthase Y202A mutant after 1 hr by UV-visible spectrophotometry
J Med Chem 58: 1012-8 (2015)
Article DOI: 10.1021/jm5011176
BindingDB Entry DOI: 10.7270/Q2N87CH6
Thymidylate synthase
(Homo sapiens (Human))
BDBM50070031
(CHEMBL3125089)
Show SMILES CC(C)C[C@H](N)C(=O)N[C@@H](CO)C(=O)N[C@@H](CS)C(=O)N[C@H](CCC(N)=O)C(=O)N[C@@H](CC(C)C)C(=O)N[C@@H](Cc1ccc(O)cc1)C(=O)N[C@@H](CCC(N)=O)C(=O)N[C@@H](CCCNC(N)=N)C(O)=O |r|
Show InChI InChI=1S/C43H71N13O13S/c1-21(2)16-25(44)35(61)55-31(19-57)40(66)56-32(20-70)41(67)51-27(12-14-34(46)60)37(63)53-29(17-22(3)4)38(64)54-30(18-23-7-9-24(58)10-8-23)39(65)50-26(11-13-33(45)59)36(62)52-28(42(68)69)6-5-15-49-43(47)48/h7-10,21-22,25-32,57-58,70H,5-6,11-20,44H2,1-4H3,(H2,45,59)(H2,46,60)(H,50,65)(H,51,67)(H,52,62)(H,53,63)(H,54,64)(H,55,61)(H,56,66)(H,68,69)(H4,47,48,49)/t25-,26-,27+,28-,29-,30-,31-,32-/m0/s1
NCI pathway
Reactome pathway
n/an/a 3.00E+5n/an/an/an/an/an/a
University of California-San Francisco
Curated by ChEMBL
Assay Description
Inhibition of His-tagged human thymidylate synthase L198A mutant after 1 hr by UV-visible spectrophotometry
J Med Chem 58: 1012-8 (2015)
Article DOI: 10.1021/jm5011176
BindingDB Entry DOI: 10.7270/Q2N87CH6
Thymidylate synthase
(Homo sapiens (Human))
BDBM50070031
(CHEMBL3125089)
Show SMILES CC(C)C[C@H](N)C(=O)N[C@@H](CO)C(=O)N[C@@H](CS)C(=O)N[C@H](CCC(N)=O)C(=O)N[C@@H](CC(C)C)C(=O)N[C@@H](Cc1ccc(O)cc1)C(=O)N[C@@H](CCC(N)=O)C(=O)N[C@@H](CCCNC(N)=N)C(O)=O |r|
Show InChI InChI=1S/C43H71N13O13S/c1-21(2)16-25(44)35(61)55-31(19-57)40(66)56-32(20-70)41(67)51-27(12-14-34(46)60)37(63)53-29(17-22(3)4)38(64)54-30(18-23-7-9-24(58)10-8-23)39(65)50-26(11-13-33(45)59)36(62)52-28(42(68)69)6-5-15-49-43(47)48/h7-10,21-22,25-32,57-58,70H,5-6,11-20,44H2,1-4H3,(H2,45,59)(H2,46,60)(H,50,65)(H,51,67)(H,52,62)(H,53,63)(H,54,64)(H,55,61)(H,56,66)(H,68,69)(H4,47,48,49)/t25-,26-,27+,28-,29-,30-,31-,32-/m0/s1
NCI pathway
Reactome pathway
n/an/a 3.00E+5n/an/an/an/an/an/a
University of California-San Francisco
Curated by ChEMBL
Assay Description
Inhibition of His-tagged human thymidylate synthase F59A mutant after 1 hr by UV-visible spectrophotometry
J Med Chem 58: 1012-8 (2015)
Article DOI: 10.1021/jm5011176
BindingDB Entry DOI: 10.7270/Q2N87CH6