BDBM50070378 CHEMBL3408520
SMILES: [H][C@@]1(Cc2ccccc2CN(CCC(=O)N(C)Cc2cc(cc(c2)C(F)(F)F)C(F)(F)F)C1=O)NC(=O)[C@@H](CCCNC(N)=O)NC(=O)[C@@H](N)Cc1c(C)cc(O)cc1C
InChI Key: InChIKey=NYBRMXDKXYPGRK-DSPMFFIESA-N
Data: 3 KI  2 IC50
Activity Spreadsheet -- Enzyme Inhibition Constant Data from BindingDB
Found 5 hits for monomerid = 50070378
Trg + Lig
Ki
nM
ΔG°
kcal/mole
IC50
nM
Kd
nM
EC50/IC50
nM
koff
s-1
kon
M-1s-1
pHTemp
°C
Mu-type opioid receptor
(Rattus norvegicus (rat))
BDBM50070378
(CHEMBL3408520)
Show SMILES [H][C@@]1(Cc2ccccc2CN(CCC(=O)N(C)Cc2cc(cc(c2)C(F)(F)F)C(F)(F)F)C1=O)NC(=O)[C@@H](CCCNC(N)=O)NC(=O)[C@@H](N)Cc1c(C)cc(O)cc1C |r|
Show InChI InChI=1S/C40H47F6N7O6/c1-22-13-29(54)14-23(2)30(22)19-31(47)35(56)50-32(9-6-11-49-38(48)59)36(57)51-33-17-25-7-4-5-8-26(25)21-53(37(33)58)12-10-34(55)52(3)20-24-15-27(39(41,42)43)18-28(16-24)40(44,45)46/h4-5,7-8,13-16,18,31-33,54H,6,9-12,17,19-21,47H2,1-3H3,(H,50,56)(H,51,57)(H3,48,49,59)/t31-,32+,33-/m0/s1
Reactome pathway
0.370n/an/an/an/an/an/an/an/a
Vrije Universiteit Brussel
Curated by ChEMBL
Assay Description
Displacement of [3H]DAMGO from rat brain MOR after 2 hrs
Eur J Med Chem 92: 64-77 (2015)
Article DOI: 10.1016/j.ejmech.2014.12.033
BindingDB Entry DOI: 10.7270/Q2M90BCC
Opioid receptors; mu & delta
(Rattus norvegicus (rat))
BDBM50070378
(CHEMBL3408520)
Show SMILES [H][C@@]1(Cc2ccccc2CN(CCC(=O)N(C)Cc2cc(cc(c2)C(F)(F)F)C(F)(F)F)C1=O)NC(=O)[C@@H](CCCNC(N)=O)NC(=O)[C@@H](N)Cc1c(C)cc(O)cc1C |r|
Show InChI InChI=1S/C40H47F6N7O6/c1-22-13-29(54)14-23(2)30(22)19-31(47)35(56)50-32(9-6-11-49-38(48)59)36(57)51-33-17-25-7-4-5-8-26(25)21-53(37(33)58)12-10-34(55)52(3)20-24-15-27(39(41,42)43)18-28(16-24)40(44,45)46/h4-5,7-8,13-16,18,31-33,54H,6,9-12,17,19-21,47H2,1-3H3,(H,50,56)(H,51,57)(H3,48,49,59)/t31-,32+,33-/m0/s1
Reactome pathway
0.550n/an/an/an/an/an/an/an/a
Vrije Universiteit Brussel
Curated by ChEMBL
Assay Description
Displacement of [3H]DSLET from rat brain DOR after 2 hrs
Eur J Med Chem 92: 64-77 (2015)
Article DOI: 10.1016/j.ejmech.2014.12.033
BindingDB Entry DOI: 10.7270/Q2M90BCC
Neurokinin 1 receptor
(Homo sapiens (Human))
BDBM50070378
(CHEMBL3408520)
Show SMILES [H][C@@]1(Cc2ccccc2CN(CCC(=O)N(C)Cc2cc(cc(c2)C(F)(F)F)C(F)(F)F)C1=O)NC(=O)[C@@H](CCCNC(N)=O)NC(=O)[C@@H](N)Cc1c(C)cc(O)cc1C |r|
Show InChI InChI=1S/C40H47F6N7O6/c1-22-13-29(54)14-23(2)30(22)19-31(47)35(56)50-32(9-6-11-49-38(48)59)36(57)51-33-17-25-7-4-5-8-26(25)21-53(37(33)58)12-10-34(55)52(3)20-24-15-27(39(41,42)43)18-28(16-24)40(44,45)46/h4-5,7-8,13-16,18,31-33,54H,6,9-12,17,19-21,47H2,1-3H3,(H,50,56)(H,51,57)(H3,48,49,59)/t31-,32+,33-/m0/s1
Reactome pathway
35n/an/an/an/an/an/an/an/a
Vrije Universiteit Brussel
Curated by ChEMBL
Assay Description
Displacement of [3H]SP from human NK1 receptor expressed in CHO cells after 20 mins by liquid scintillation counting analysis
Eur J Med Chem 92: 64-77 (2015)
Article DOI: 10.1016/j.ejmech.2014.12.033
BindingDB Entry DOI: 10.7270/Q2M90BCC
Mu-type opioid receptor
(GUINEA PIG)
BDBM50070378
(CHEMBL3408520)
Show SMILES [H][C@@]1(Cc2ccccc2CN(CCC(=O)N(C)Cc2cc(cc(c2)C(F)(F)F)C(F)(F)F)C1=O)NC(=O)[C@@H](CCCNC(N)=O)NC(=O)[C@@H](N)Cc1c(C)cc(O)cc1C |r|
Show InChI InChI=1S/C40H47F6N7O6/c1-22-13-29(54)14-23(2)30(22)19-31(47)35(56)50-32(9-6-11-49-38(48)59)36(57)51-33-17-25-7-4-5-8-26(25)21-53(37(33)58)12-10-34(55)52(3)20-24-15-27(39(41,42)43)18-28(16-24)40(44,45)46/h4-5,7-8,13-16,18,31-33,54H,6,9-12,17,19-21,47H2,1-3H3,(H,50,56)(H,51,57)(H3,48,49,59)/t31-,32+,33-/m0/s1
n/an/a 2n/an/an/an/an/an/a
Vrije Universiteit Brussel
Curated by ChEMBL
Assay Description
Activation of MOR in guinea pig ileum
Eur J Med Chem 92: 64-77 (2015)
Article DOI: 10.1016/j.ejmech.2014.12.033
BindingDB Entry DOI: 10.7270/Q2M90BCC
Delta-type opioid receptor
(MOUSE)
BDBM50070378
(CHEMBL3408520)
Show SMILES [H][C@@]1(Cc2ccccc2CN(CCC(=O)N(C)Cc2cc(cc(c2)C(F)(F)F)C(F)(F)F)C1=O)NC(=O)[C@@H](CCCNC(N)=O)NC(=O)[C@@H](N)Cc1c(C)cc(O)cc1C |r|
Show InChI InChI=1S/C40H47F6N7O6/c1-22-13-29(54)14-23(2)30(22)19-31(47)35(56)50-32(9-6-11-49-38(48)59)36(57)51-33-17-25-7-4-5-8-26(25)21-53(37(33)58)12-10-34(55)52(3)20-24-15-27(39(41,42)43)18-28(16-24)40(44,45)46/h4-5,7-8,13-16,18,31-33,54H,6,9-12,17,19-21,47H2,1-3H3,(H,50,56)(H,51,57)(H3,48,49,59)/t31-,32+,33-/m0/s1
Reactome pathway
n/an/a 1.10n/an/an/an/an/an/a
Vrije Universiteit Brussel
Curated by ChEMBL
Assay Description
Activation of DOR in mouse vas deferens
Eur J Med Chem 92: 64-77 (2015)
Article DOI: 10.1016/j.ejmech.2014.12.033
BindingDB Entry DOI: 10.7270/Q2M90BCC