null
SMILES: CCc1c(Cc2ccccc2)nc(SCSC)[nH]c1=O
InChI Key: InChIKey=ZBJRMWHGLCGQSW-UHFFFAOYSA-N
Activity Spreadsheet -- Enzyme Inhibition Constant Data from BindingDB
Found 1 hit for monomerid = 50070468
Trg + Lig
Ki
nM
ΔG°
kcal/mole
IC50
nM
Kd
nM
EC50/IC50
nM
koff
s-1
kon
M-1s-1
pHTemp
°C
Reverse transcriptase/RNaseH
(Human immunodeficiency virus 1)
BDBM50070468
(6-Benzyl-5-ethyl-2-methylsulfanylmethylsulfanyl-3H...)
Show SMILES CCc1c(Cc2ccccc2)nc(SCSC)[nH]c1=O
Show InChI InChI=1S/C15H18N2OS2/c1-3-12-13(9-11-7-5-4-6-8-11)16-15(17-14(12)18)20-10-19-2/h4-8H,3,9-10H2,1-2H3,(H,16,17,18)
n/an/a 9.70E+3n/an/an/an/an/an/a
Institute
Curated by ChEMBL
Assay Description
Compound was evaluated for enzymatic inhibitory activity against recombinant HIV reverse transcriptase
Bioorg Med Chem Lett 8: 1461-6 (1999)
BindingDB Entry DOI: 10.7270/Q24X56XN