BDBM50071270 CHEMBL3409994
SMILES: Clc1ccc(cc1S(=O)(=O)NC1CCCC1)-c1csc(=O)[nH]1
InChI Key: InChIKey=PBWTZCXFWIEPCV-UHFFFAOYSA-N
Data: 1 IC50
PDB links: 1 PDB ID matches this monomer.
Activity Spreadsheet -- Enzyme Inhibition Constant Data from BindingDB
Found 1 hit for monomerid = 50071270
Trg + Lig
Ki
nM
ΔG°
kcal/mole
IC50
nM
Kd
nM
EC50/IC50
nM
koff
s-1
kon
M-1s-1
pHTemp
°C
Bromodomain-containing protein 4
(Homo sapiens (Human))
BDBM50071270
(CHEMBL3409994)
Show SMILES Clc1ccc(cc1S(=O)(=O)NC1CCCC1)-c1csc(=O)[nH]1
Show InChI InChI=1S/C14H15ClN2O3S2/c15-11-6-5-9(12-8-21-14(18)16-12)7-13(11)22(19,20)17-10-3-1-2-4-10/h5-8,10,17H,1-4H2,(H,16,18)
n/an/a 250n/an/an/an/an/an/a
Shanghai Institute of Materia Medica
Curated by ChEMBL
Assay Description
Inhibition of BRD4(1) (unknown origin) incubated for 4 hrs by (+)-JQ1 fluorescent ligand based fluorescence anisotrophy
J Med Chem 58: 1281-97 (2015)
Article DOI: 10.1021/jm501504k
BindingDB Entry DOI: 10.7270/Q2P270TX
3D
3D Structure (crystal)