BDBM50071373 CHEMBL3410222
SMILES: CN1Cc2c(ncn2-c2cccc(Cl)c2C1=O)C#Cc1ccccc1
InChI Key: InChIKey=KDMMIKQMHNBKAV-UHFFFAOYSA-N
Data: 1 KI  1 IC50
Activity Spreadsheet -- Enzyme Inhibition Constant Data from BindingDB
Found 2 hits for monomerid = 50071373
Trg + Lig
Ki
nM
ΔG°
kcal/mole
IC50
nM
Kd
nM
EC50/IC50
nM
koff
s-1
kon
M-1s-1
pHTemp
°C
Metabotropic glutamate receptor 5
(Homo sapiens (Human))
BDBM50071373
(CHEMBL3410222)
Show SMILES CN1Cc2c(ncn2-c2cccc(Cl)c2C1=O)C#Cc1ccccc1
Show InChI InChI=1S/C20H14ClN3O/c1-23-12-18-16(11-10-14-6-3-2-4-7-14)22-13-24(18)17-9-5-8-15(21)19(17)20(23)25/h2-9,13H,12H2,1H3
1.44E+3n/an/an/an/an/an/an/an/a
Roche Pharmaceutical Research and Early Development
Curated by ChEMBL
Assay Description
Displacement of [3H]MPEP from mGlu5 receptor (unknown origin) expressed in HEK293 cells by competition binding assay
J Med Chem 58: 1358-71 (2015)
Article DOI: 10.1021/jm501642c
BindingDB Entry DOI: 10.7270/Q2J96825
Metabotropic glutamate receptor 5
(Homo sapiens (Human))
BDBM50071373
(CHEMBL3410222)
Show SMILES CN1Cc2c(ncn2-c2cccc(Cl)c2C1=O)C#Cc1ccccc1
Show InChI InChI=1S/C20H14ClN3O/c1-23-12-18-16(11-10-14-6-3-2-4-7-14)22-13-24(18)17-9-5-8-15(21)19(17)20(23)25/h2-9,13H,12H2,1H3
n/an/a 872n/an/an/an/an/an/a
Roche Pharmaceutical Research and Early Development
Curated by ChEMBL
Assay Description
Negative allosteric modulation of mGlu5 (unknown origin) expressed in HEK293 cells assessed as inhibition of L-AP4-induced calcium mobilization incub...
J Med Chem 58: 1358-71 (2015)
Article DOI: 10.1021/jm501642c
BindingDB Entry DOI: 10.7270/Q2J96825