null
SMILES: OC(=O)c1cc(Br)ccc1NC(=O)CCCCC(=O)Nc1ccc(Br)cc1
InChI Key: InChIKey=LKXVZIINNOKKQM-UHFFFAOYSA-N
Activity Spreadsheet -- Enzyme Inhibition Constant Data from BindingDB
Found 2 hits for monomerid = 50071764
Trg + Lig
Ki
nM
ΔG°
kcal/mole
IC50
nM
Kd
nM
EC50/IC50
nM
koff
s-1
kon
M-1s-1
pHTemp
°C
Reverse transcriptase/RNaseH
(Human immunodeficiency virus 1)
BDBM50071764
(5-Bromo-2-[5-(4-bromo-phenylcarbamoyl)-pentanoylam...)
Show SMILES OC(=O)c1cc(Br)ccc1NC(=O)CCCCC(=O)Nc1ccc(Br)cc1
Show InChI InChI=1S/C19H18Br2N2O4/c20-12-5-8-14(9-6-12)22-17(24)3-1-2-4-18(25)23-16-10-7-13(21)11-15(16)19(26)27/h5-11H,1-4H2,(H,22,24)(H,23,25)(H,26,27)
n/an/a 1.50E+4n/an/an/an/an/an/a
GlaxoWellcome Medicines Research Center
Curated by ChEMBL
Assay Description
Evaluated for inhibition of HIV-2 reverse transcriptase
Bioorg Med Chem Lett 8: 2623-8 (1999)
BindingDB Entry DOI: 10.7270/Q2RF5T6F
Reverse transcriptase/RNaseH
(Human immunodeficiency virus 1)
BDBM50071764
(5-Bromo-2-[5-(4-bromo-phenylcarbamoyl)-pentanoylam...)
Show SMILES OC(=O)c1cc(Br)ccc1NC(=O)CCCCC(=O)Nc1ccc(Br)cc1
Show InChI InChI=1S/C19H18Br2N2O4/c20-12-5-8-14(9-6-12)22-17(24)3-1-2-4-18(25)23-16-10-7-13(21)11-15(16)19(26)27/h5-11H,1-4H2,(H,22,24)(H,23,25)(H,26,27)
n/an/a 3.20E+4n/an/an/an/an/an/a
GlaxoWellcome Medicines Research Center
Curated by ChEMBL
Assay Description
Evaluated for inhibition of HIV-2 reverse transcriptase
Bioorg Med Chem Lett 8: 2623-8 (1999)
BindingDB Entry DOI: 10.7270/Q2RF5T6F