null
SMILES: OC(=O)c1cc(F)ccc1NC(=O)CCCCC(=O)Nc1ccc(F)cc1C(O)=O
InChI Key: InChIKey=DCLMUZAQPSKFNP-UHFFFAOYSA-N
Activity Spreadsheet -- Enzyme Inhibition Constant Data from BindingDB
Found 2 hits for monomerid = 50071769
Trg + Lig
Ki
nM
ΔG°
kcal/mole
IC50
nM
Kd
nM
EC50/IC50
nM
koff
s-1
kon
M-1s-1
pHTemp
°C
Reverse transcriptase/RNaseH
(Human immunodeficiency virus 1)
BDBM50071769
(2-({6-[(2-carboxy-4-fluorophenyl)amino]-6-oxohexan...)
Show SMILES OC(=O)c1cc(F)ccc1NC(=O)CCCCC(=O)Nc1ccc(F)cc1C(O)=O
Show InChI InChI=1S/C20H18F2N2O6/c21-11-5-7-15(13(9-11)19(27)28)23-17(25)3-1-2-4-18(26)24-16-8-6-12(22)10-14(16)20(29)30/h5-10H,1-4H2,(H,23,25)(H,24,26)(H,27,28)(H,29,30)
n/an/a>1.20E+5n/an/an/an/an/an/a
GlaxoWellcome Medicines Research Center
Curated by ChEMBL
Assay Description
Evaluated for inhibition of HIV-2 reverse transcriptase
Bioorg Med Chem Lett 8: 2623-8 (1999)
BindingDB Entry DOI: 10.7270/Q2RF5T6F
Reverse transcriptase/RNaseH
(Human immunodeficiency virus 1)
BDBM50071769
(2-({6-[(2-carboxy-4-fluorophenyl)amino]-6-oxohexan...)
Show SMILES OC(=O)c1cc(F)ccc1NC(=O)CCCCC(=O)Nc1ccc(F)cc1C(O)=O
Show InChI InChI=1S/C20H18F2N2O6/c21-11-5-7-15(13(9-11)19(27)28)23-17(25)3-1-2-4-18(26)24-16-8-6-12(22)10-14(16)20(29)30/h5-10H,1-4H2,(H,23,25)(H,24,26)(H,27,28)(H,29,30)
n/an/a>1.20E+5n/an/an/an/an/an/a
GlaxoWellcome Medicines Research Center
Curated by ChEMBL
Assay Description
Evaluated for inhibition of HIV-1 reverse transcriptase
Bioorg Med Chem Lett 8: 2623-8 (1999)
BindingDB Entry DOI: 10.7270/Q2RF5T6F