BDBM50071809 CHEMBL1333704
SMILES: Cc1cc(ccc1[N+]([O-])=O)C(=O)Nc1cnc(O)nc1O
InChI Key: InChIKey=UFFGDKGPWIPDDI-UHFFFAOYSA-N
Data: 1 IC50
Activity Spreadsheet -- Enzyme Inhibition Constant Data from BindingDB
Found 1 hit for monomerid = 50071809
Trg + Lig
Ki
nM
ΔG°
kcal/mole
IC50
nM
Kd
nM
EC50/IC50
nM
koff
s-1
kon
M-1s-1
pHTemp
°C
Krueppel-like factor 10
(Homo sapiens (Human))
BDBM50071809
(CHEMBL1333704)
Show SMILES Cc1cc(ccc1[N+]([O-])=O)C(=O)Nc1cnc(O)nc1O
Show InChI InChI=1S/C12H10N4O5/c1-6-4-7(2-3-9(6)16(20)21)10(17)14-8-5-13-12(19)15-11(8)18/h2-5H,1H3,(H,14,17)(H2,13,15,18,19)
n/an/a 1.00E+4n/an/an/an/an/an/a
Beth Israel Deaconess Medical Center
Curated by ChEMBL
Assay Description
Inhibition of human KLF10 expressed in human HeLa cells assessed as reduction in transcriptional activity after 24 hrs by CACCC-responsive promoter d...
J Med Chem 58: 1466-78 (2015)
Article DOI: 10.1021/jm5018187
BindingDB Entry DOI: 10.7270/Q2WM1G3D