BDBM50072001 11-Ethyl-1,3,3-trimethyl-4,11-dihydro-3H-pyrido[3,2-a]carbazole::CHEMBL91858
SMILES: CCn1c2ccccc2c2ccc3NC(C)(C)C=C(C)c3c12
InChI Key: InChIKey=XIEIFFBKPGJSCW-UHFFFAOYSA-N
Data: 2 KI  1 IC50
Activity Spreadsheet -- Enzyme Inhibition Constant Data from BindingDB
Found 3 hits for monomerid = 50072001
Trg + Lig
Ki
nM
ΔG°
kcal/mole
IC50
nM
Kd
nM
EC50/IC50
nM
koff
s-1
kon
M-1s-1
pHTemp
°C
Progesterone receptor
(Homo sapiens (Human))
BDBM50072001
(11-Ethyl-1,3,3-trimethyl-4,11-dihydro-3H-pyrido[3,...)
Show SMILES CCn1c2ccccc2c2ccc3NC(C)(C)C=C(C)c3c12 |t:18|
Show InChI InChI=1S/C20H22N2/c1-5-22-17-9-7-6-8-14(17)15-10-11-16-18(19(15)22)13(2)12-20(3,4)21-16/h6-12,21H,5H2,1-4H3
169n/an/an/an/an/an/an/an/a
Ligand Pharmaceuticals
Curated by ChEMBL
Assay Description
Binding affinity against human progesterone receptor-A (hPR-A)
Bioorg Med Chem Lett 8: 2731-6 (1999)
BindingDB Entry DOI: 10.7270/Q2QF8S1M
Progesterone receptor
(Homo sapiens (Human))
BDBM50072001
(11-Ethyl-1,3,3-trimethyl-4,11-dihydro-3H-pyrido[3,...)
Show SMILES CCn1c2ccccc2c2ccc3NC(C)(C)C=C(C)c3c12 |t:18|
Show InChI InChI=1S/C20H22N2/c1-5-22-17-9-7-6-8-14(17)15-10-11-16-18(19(15)22)13(2)12-20(3,4)21-16/h6-12,21H,5H2,1-4H3
170n/an/an/an/an/an/an/an/a
Scientific Computing Ltd.
Curated by ChEMBL
Assay Description
Displacement of [3H]progesterone from Progesterone receptor
J Med Chem 49: 4261-8 (2006)
Article DOI: 10.1021/jm060234e
BindingDB Entry DOI: 10.7270/Q2V69NB6
Progesterone receptor
(Homo sapiens (Human))
BDBM50072001
(11-Ethyl-1,3,3-trimethyl-4,11-dihydro-3H-pyrido[3,...)
Show SMILES CCn1c2ccccc2c2ccc3NC(C)(C)C=C(C)c3c12 |t:18|
Show InChI InChI=1S/C20H22N2/c1-5-22-17-9-7-6-8-14(17)15-10-11-16-18(19(15)22)13(2)12-20(3,4)21-16/h6-12,21H,5H2,1-4H3
n/an/a 284n/an/an/an/an/an/a
Ligand Pharmaceuticals
Curated by ChEMBL
Assay Description
Binding affinity against human progesterone receptor-A (hPR-A)
Bioorg Med Chem Lett 8: 2731-6 (1999)
BindingDB Entry DOI: 10.7270/Q2QF8S1M