null
SMILES: CC1CC(C)(C)Nc2cc3Cc4ccccc4-c3cc12
InChI Key: InChIKey=ZZUIZHCKMHXMMD-UHFFFAOYSA-N
Activity Spreadsheet -- Enzyme Inhibition Constant Data from BindingDB
Found 2 hits for monomerid = 50072012
Trg + Lig
Ki
nM
ΔG°
kcal/mole
IC50
nM
Kd
nM
EC50/IC50
nM
koff
s-1
kon
M-1s-1
pHTemp
°C
Progesterone receptor
(Homo sapiens (Human))
BDBM50072012
(2,2,4-Trimethyl-2,3,4,10-tetrahydro-1H-indeno[1,2-...)
Show SMILES CC1CC(C)(C)Nc2cc3Cc4ccccc4-c3cc12
Show InChI InChI=1S/C19H21N/c1-12-11-19(2,3)20-18-9-14-8-13-6-4-5-7-15(13)17(14)10-16(12)18/h4-7,9-10,12,20H,8,11H2,1-3H3
87n/an/an/an/an/an/an/an/a
Ligand Pharmaceuticals
Curated by ChEMBL
Assay Description
Binding affinity against human progesterone receptor-A (hPR-A)
Bioorg Med Chem Lett 8: 2731-6 (1999)
BindingDB Entry DOI: 10.7270/Q2QF8S1M
Progesterone receptor
(Homo sapiens (Human))
BDBM50072012
(2,2,4-Trimethyl-2,3,4,10-tetrahydro-1H-indeno[1,2-...)
Show SMILES CC1CC(C)(C)Nc2cc3Cc4ccccc4-c3cc12
Show InChI InChI=1S/C19H21N/c1-12-11-19(2,3)20-18-9-14-8-13-6-4-5-7-15(13)17(14)10-16(12)18/h4-7,9-10,12,20H,8,11H2,1-3H3
n/an/a 424n/an/an/an/an/an/a
Ligand Pharmaceuticals
Curated by ChEMBL
Assay Description
Antagonist activity against human progesterone receptor B (hPR-B) in cotransfected CV-1 cells
Bioorg Med Chem Lett 8: 2731-6 (1999)
BindingDB Entry DOI: 10.7270/Q2QF8S1M