BDBM50072013 6,8-Difluoro-2,2,4-trimethyl-2,10-dihydro-1H-indeno[1,2-g]quinolin-10-ol::CHEMBL316348
SMILES: CC1=CC(C)(C)Nc2cc3C(O)c4cc(F)cc(F)c4-c3cc12
InChI Key: InChIKey=TVLDOKOBXPYHMO-UHFFFAOYSA-N
Data: 1 KI  1 IC50
Activity Spreadsheet -- Enzyme Inhibition Constant Data from BindingDB
Found 2 hits for monomerid = 50072013
Trg + Lig
Ki
nM
ΔG°
kcal/mole
IC50
nM
Kd
nM
EC50/IC50
nM
koff
s-1
kon
M-1s-1
pHTemp
°C
Progesterone receptor
(Homo sapiens (Human))
BDBM50072013
(6,8-Difluoro-2,2,4-trimethyl-2,10-dihydro-1H-inden...)
Show SMILES CC1=CC(C)(C)Nc2cc3C(O)c4cc(F)cc(F)c4-c3cc12 |t:1|
Show InChI InChI=1S/C19H17F2NO/c1-9-8-19(2,3)22-16-7-13-12(6-11(9)16)17-14(18(13)23)4-10(20)5-15(17)21/h4-8,18,22-23H,1-3H3
26n/an/an/an/an/an/an/an/a
Ligand Pharmaceuticals
Curated by ChEMBL
Assay Description
Antagonist activity against human progesterone receptor B (hPR-B) in cotransfected CV-1 cells
Bioorg Med Chem Lett 8: 2731-6 (1999)
BindingDB Entry DOI: 10.7270/Q2QF8S1M
Progesterone receptor
(Homo sapiens (Human))
BDBM50072013
(6,8-Difluoro-2,2,4-trimethyl-2,10-dihydro-1H-inden...)
Show SMILES CC1=CC(C)(C)Nc2cc3C(O)c4cc(F)cc(F)c4-c3cc12 |t:1|
Show InChI InChI=1S/C19H17F2NO/c1-9-8-19(2,3)22-16-7-13-12(6-11(9)16)17-14(18(13)23)4-10(20)5-15(17)21/h4-8,18,22-23H,1-3H3
n/an/a 80n/an/an/an/an/an/a
Ligand Pharmaceuticals
Curated by ChEMBL
Assay Description
Antagonist activity against human progesterone receptor B (hPR-B) in cotransfected CV-1 cells
Bioorg Med Chem Lett 8: 2731-6 (1999)
BindingDB Entry DOI: 10.7270/Q2QF8S1M