BDBM50072016 1,3,3-Trimethyl-3,4-dihydro-benzo[4,5]furo[2,3-f]quinoline::1,3,3-trimethyl-3,4-dihydrobenzofuro[2,3-f]quinoline::CHEMBL327551
SMILES: CC1=CC(C)(C)Nc2ccc3c4ccccc4oc3c12
InChI Key: InChIKey=ODCOFTJGVUCRGA-UHFFFAOYSA-N
Data: 2 KI  1 IC50
Activity Spreadsheet -- Enzyme Inhibition Constant Data from BindingDB
Found 3 hits for monomerid = 50072016
Trg + Lig
Ki
nM
ΔG°
kcal/mole
IC50
nM
Kd
nM
EC50/IC50
nM
koff
s-1
kon
M-1s-1
pHTemp
°C
Progesterone receptor
(Homo sapiens (Human))
BDBM50072016
(1,3,3-Trimethyl-3,4-dihydro-benzo[4,5]furo[2,3-f]q...)
Show SMILES CC1=CC(C)(C)Nc2ccc3c4ccccc4oc3c12 |t:1|
Show InChI InChI=1S/C18H17NO/c1-11-10-18(2,3)19-14-9-8-13-12-6-4-5-7-15(12)20-17(13)16(11)14/h4-10,19H,1-3H3
77n/an/an/an/an/an/an/an/a
Ligand Pharmaceuticals
Curated by ChEMBL
Assay Description
Binding affinity against human progesterone receptor-A (hPR-A)
Bioorg Med Chem Lett 8: 2731-6 (1999)
BindingDB Entry DOI: 10.7270/Q2QF8S1M
Progesterone receptor
(Homo sapiens (Human))
BDBM50072016
(1,3,3-Trimethyl-3,4-dihydro-benzo[4,5]furo[2,3-f]q...)
Show SMILES CC1=CC(C)(C)Nc2ccc3c4ccccc4oc3c12 |t:1|
Show InChI InChI=1S/C18H17NO/c1-11-10-18(2,3)19-14-9-8-13-12-6-4-5-7-15(12)20-17(13)16(11)14/h4-10,19H,1-3H3
78n/an/an/an/an/an/an/an/a
Scientific Computing Ltd.
Curated by ChEMBL
Assay Description
Displacement of [3H]progesterone from Progesterone receptor
J Med Chem 49: 4261-8 (2006)
Article DOI: 10.1021/jm060234e
BindingDB Entry DOI: 10.7270/Q2V69NB6
Progesterone receptor
(Homo sapiens (Human))
BDBM50072016
(1,3,3-Trimethyl-3,4-dihydro-benzo[4,5]furo[2,3-f]q...)
Show SMILES CC1=CC(C)(C)Nc2ccc3c4ccccc4oc3c12 |t:1|
Show InChI InChI=1S/C18H17NO/c1-11-10-18(2,3)19-14-9-8-13-12-6-4-5-7-15(12)20-17(13)16(11)14/h4-10,19H,1-3H3
n/an/a 1.14E+3n/an/an/an/an/an/a
Ligand Pharmaceuticals
Curated by ChEMBL
Assay Description
Antagonist activity against human progesterone receptor B (hPR-B) in cotransfected CV-1 cells
Bioorg Med Chem Lett 8: 2731-6 (1999)
BindingDB Entry DOI: 10.7270/Q2QF8S1M