BDBM50072102 CHEMBL3407884
SMILES: Clc1ccc(cc1Cl)-c1cc(ncn1)-c1noc(=O)[nH]1
InChI Key: InChIKey=DHGWYBBUILQBHX-UHFFFAOYSA-N
Data: 2 IC50
Activity Spreadsheet -- Enzyme Inhibition Constant Data from BindingDB
Found 2 hits for monomerid = 50072102
Trg + Lig
Ki
nM
ΔG°
kcal/mole
IC50
nM
Kd
nM
EC50/IC50
nM
koff
s-1
kon
M-1s-1
pHTemp
°C
Kynurenine 3-monooxygenase
(Homo sapiens (Human))
BDBM50072102
(CHEMBL3407884)
Show SMILES Clc1ccc(cc1Cl)-c1cc(ncn1)-c1noc(=O)[nH]1
Show InChI InChI=1S/C12H6Cl2N4O2/c13-7-2-1-6(3-8(7)14)9-4-10(16-5-15-9)11-17-12(19)20-18-11/h1-5H,(H,17,18,19)
Reactome pathway
n/an/a 60n/an/an/an/an/an/a
Evotec (U.K.) Ltd
Curated by ChEMBL
Assay Description
Inhibition of human KMO transfected in CHO cells assessed as conversion of kynurenine to 3-hydroxykynurenine by LC-MS/MS analysis
J Med Chem 58: 1159-83 (2015)
Article DOI: 10.1021/jm501350y
BindingDB Entry DOI: 10.7270/Q2445P5N
Kynurenine 3-monooxygenase
(Homo sapiens (Human))
BDBM50072102
(CHEMBL3407884)
Show SMILES Clc1ccc(cc1Cl)-c1cc(ncn1)-c1noc(=O)[nH]1
Show InChI InChI=1S/C12H6Cl2N4O2/c13-7-2-1-6(3-8(7)14)9-4-10(16-5-15-9)11-17-12(19)20-18-11/h1-5H,(H,17,18,19)
Reactome pathway
n/an/a 12n/an/an/an/an/an/a
Evotec (U.K.) Ltd
Curated by ChEMBL
Assay Description
Inhibition of human KMO assessed as conversion of kynurenine to 3-hydroxykynurenine by LC-MS/MS analysis
J Med Chem 58: 1159-83 (2015)
Article DOI: 10.1021/jm501350y
BindingDB Entry DOI: 10.7270/Q2445P5N