null
SMILES: Clc1ccc(cc1Cl)-c1cc(ncn1)-n1cccn1
InChI Key: InChIKey=QKDPTHAYQCPXSV-UHFFFAOYSA-N
Activity Spreadsheet -- Enzyme Inhibition Constant Data from BindingDB
Found 1 hit for monomerid = 50072111
Trg + Lig
Ki
nM
ΔG°
kcal/mole
IC50
nM
Kd
nM
EC50/IC50
nM
koff
s-1
kon
M-1s-1
pHTemp
°C
Kynurenine 3-monooxygenase
(Homo sapiens (Human))
BDBM50072111
(CHEMBL3407892)
Show SMILES Clc1ccc(cc1Cl)-c1cc(ncn1)-n1cccn1
Show InChI InChI=1S/C13H8Cl2N4/c14-10-3-2-9(6-11(10)15)12-7-13(17-8-16-12)19-5-1-4-18-19/h1-8H
Reactome pathway
n/an/a>1.00E+4n/an/an/an/an/an/a
Evotec (U.K.) Ltd
Curated by ChEMBL
Assay Description
Inhibition of human KMO assessed as conversion of kynurenine to 3-hydroxykynurenine by LC-MS/MS analysis
J Med Chem 58: 1159-83 (2015)
Article DOI: 10.1021/jm501350y
BindingDB Entry DOI: 10.7270/Q2445P5N