null
SMILES: Clc1ccc(cc1Cl)-c1cc(NC(=O)c2ccccc2)ncn1
InChI Key: InChIKey=DZNHEUOPIFSBLQ-UHFFFAOYSA-N
Activity Spreadsheet -- Enzyme Inhibition Constant Data from BindingDB
Found 1 hit for monomerid = 50072116
Trg + Lig
Ki
nM
ΔG°
kcal/mole
IC50
nM
Kd
nM
EC50/IC50
nM
koff
s-1
kon
M-1s-1
pHTemp
°C
Kynurenine 3-monooxygenase
(Homo sapiens (Human))
BDBM50072116
(CHEMBL3407897)
Show SMILES Clc1ccc(cc1Cl)-c1cc(NC(=O)c2ccccc2)ncn1
Show InChI InChI=1S/C17H11Cl2N3O/c18-13-7-6-12(8-14(13)19)15-9-16(21-10-20-15)22-17(23)11-4-2-1-3-5-11/h1-10H,(H,20,21,22,23)
Reactome pathway
n/an/a>1.00E+4n/an/an/an/an/an/a
Evotec (U.K.) Ltd
Curated by ChEMBL
Assay Description
Inhibition of human KMO assessed as conversion of kynurenine to 3-hydroxykynurenine by LC-MS/MS analysis
J Med Chem 58: 1159-83 (2015)
Article DOI: 10.1021/jm501350y
BindingDB Entry DOI: 10.7270/Q2445P5N