null
SMILES: N#Cc1c(Sc2ccc3ccccc3c2)[nH]c(Sc2ccc3ccccc3c2)c1C#N
InChI Key: InChIKey=RKZVAHQAAAMDRN-UHFFFAOYSA-N
Activity Spreadsheet -- Enzyme Inhibition Constant Data from BindingDB
Found 2 hits for monomerid = 50072160
Trg + Lig
Ki
nM
ΔG°
kcal/mole
IC50
nM
Kd
nM
EC50/IC50
nM
koff
s-1
kon
M-1s-1
pHTemp
°C
Dual specificity mitogen-activated protein kinase kinase 1
(Homo sapiens (Human))
BDBM50072160
(2,5-Bis-(naphthalen-2-ylsulfanyl)-1H-pyrrole-3,4-d...)
Show SMILES N#Cc1c(Sc2ccc3ccccc3c2)[nH]c(Sc2ccc3ccccc3c2)c1C#N
Show InChI InChI=1S/C26H15N3S2/c27-15-23-24(16-28)26(31-22-12-10-18-6-2-4-8-20(18)14-22)29-25(23)30-21-11-9-17-5-1-3-7-19(17)13-21/h1-14,29H
Reactome pathway
n/an/a 2.10E+3n/an/an/an/an/an/a
DuPont Pharmaceuticals Company
Curated by ChEMBL
Assay Description
Non-competitive inhibition of the dual specificity kinase MEK
Bioorg Med Chem Lett 8: 2839-44 (1999)
BindingDB Entry DOI: 10.7270/Q2MW2HNN
Dual specificity mitogen-activated protein kinase kinase 1/2
(Homo sapiens (Human))
BDBM50072160
(2,5-Bis-(naphthalen-2-ylsulfanyl)-1H-pyrrole-3,4-d...)
Show SMILES N#Cc1c(Sc2ccc3ccccc3c2)[nH]c(Sc2ccc3ccccc3c2)c1C#N
Show InChI InChI=1S/C26H15N3S2/c27-15-23-24(16-28)26(31-22-12-10-18-6-2-4-8-20(18)14-22)29-25(23)30-21-11-9-17-5-1-3-7-19(17)13-21/h1-14,29H
n/an/a 2.89E+4n/an/an/an/an/an/a
DuPont Pharmaceuticals Company
Curated by ChEMBL
Assay Description
Ability to antagonise AP-1 transcriptional activity
Bioorg Med Chem Lett 8: 2839-44 (1999)
BindingDB Entry DOI: 10.7270/Q2MW2HNN