null
SMILES: N=C(Sc1cccs1)C(C#N)C(C#N)C(=N)Sc1cccs1
InChI Key: InChIKey=AVLFVQNUWUBZLW-UHFFFAOYSA-N
Activity Spreadsheet -- Enzyme Inhibition Constant Data from BindingDB
Found 2 hits for monomerid = 50072163
Trg + Lig
Ki
nM
ΔG°
kcal/mole
IC50
nM
Kd
nM
EC50/IC50
nM
koff
s-1
kon
M-1s-1
pHTemp
°C
Dual specificity mitogen-activated protein kinase kinase 1
(Homo sapiens (Human))
BDBM50072163
(2,3-Bis-[1-amino-1-(thiophen-2-ylsulfanyl)-meth-(Z...)
Show SMILES N=C(Sc1cccs1)C(C#N)C(C#N)C(=N)Sc1cccs1
Show InChI InChI=1S/C14H10N4S4/c15-7-9(13(17)21-11-3-1-5-19-11)10(8-16)14(18)22-12-4-2-6-20-12/h1-6,9-10,17-18H
Reactome pathway
n/an/a 300n/an/an/an/an/an/a
DuPont Pharmaceuticals Company
Curated by ChEMBL
Assay Description
Non-competitive inhibition of the dual specificity kinase MEK
Bioorg Med Chem Lett 8: 2839-44 (1999)
BindingDB Entry DOI: 10.7270/Q2MW2HNN
Dual specificity mitogen-activated protein kinase kinase 1/2
(Homo sapiens (Human))
BDBM50072163
(2,3-Bis-[1-amino-1-(thiophen-2-ylsulfanyl)-meth-(Z...)
Show SMILES N=C(Sc1cccs1)C(C#N)C(C#N)C(=N)Sc1cccs1
Show InChI InChI=1S/C14H10N4S4/c15-7-9(13(17)21-11-3-1-5-19-11)10(8-16)14(18)22-12-4-2-6-20-12/h1-6,9-10,17-18H
n/an/a 1.20E+3n/an/an/an/an/an/a
DuPont Pharmaceuticals Company
Curated by ChEMBL
Assay Description
Ability to antagonise AP-1 transcriptional activity
Bioorg Med Chem Lett 8: 2839-44 (1999)
BindingDB Entry DOI: 10.7270/Q2MW2HNN