BDBM50072238 CHEMBL3408315
SMILES: Cn1ncc(C(=O)c2ccc3n(C)c(=O)n(c3c2)C(C)(C)C)c1O
InChI Key: InChIKey=CSVPARJLHWINOM-UHFFFAOYSA-N
Data: 1 IC50
Activity Spreadsheet -- Enzyme Inhibition Constant Data from BindingDB
Found 1 hit for monomerid = 50072238
Trg + Lig
Ki
nM
ΔG°
kcal/mole
IC50
nM
Kd
nM
EC50/IC50
nM
koff
s-1
kon
M-1s-1
pHTemp
°C
4-hydroxyphenylpyruvate dioxygenase
(Homo sapiens (Human))
BDBM50072238
(CHEMBL3408315)
Show SMILES Cn1ncc(C(=O)c2ccc3n(C)c(=O)n(c3c2)C(C)(C)C)c1O
Show InChI InChI=1S/C17H20N4O3/c1-17(2,3)21-13-8-10(6-7-12(13)19(4)16(21)24)14(22)11-9-18-20(5)15(11)23/h6-9,23H,1-5H3
n/an/a 100n/an/an/an/an/an/a
Central China Normal University
Curated by ChEMBL
Assay Description
Inhibition of human recombinant His-tagged HPPD expressed in Escherichia coli BL21(DE3) by UV/visible plate reader analysis
Eur J Med Chem 92: 427-38 (2015)
Article DOI: 10.1016/j.ejmech.2015.01.018
BindingDB Entry DOI: 10.7270/Q20C4XFX