BDBM50072263 CHEMBL3408318
SMILES: Cn1ncc(C(=O)c2ccc3n(C)c(=O)n(C4CC4)c3c2)c1O
InChI Key: InChIKey=SPCCHXPDTKTTFR-UHFFFAOYSA-N
Data: 1 IC50
Activity Spreadsheet -- Enzyme Inhibition Constant Data from BindingDB
Found 1 hit for monomerid = 50072263
Trg + Lig
Ki
nM
ΔG°
kcal/mole
IC50
nM
Kd
nM
EC50/IC50
nM
koff
s-1
kon
M-1s-1
pHTemp
°C
4-hydroxyphenylpyruvate dioxygenase
(Homo sapiens (Human))
BDBM50072263
(CHEMBL3408318)
Show SMILES Cn1ncc(C(=O)c2ccc3n(C)c(=O)n(C4CC4)c3c2)c1O
Show InChI InChI=1S/C16H16N4O3/c1-18-12-6-3-9(14(21)11-8-17-19(2)15(11)22)7-13(12)20(16(18)23)10-4-5-10/h3,6-8,10,22H,4-5H2,1-2H3
n/an/a 100n/an/an/an/an/an/a
Central China Normal University
Curated by ChEMBL
Assay Description
Inhibition of human recombinant His-tagged HPPD expressed in Escherichia coli BL21(DE3) by UV/visible plate reader analysis
Eur J Med Chem 92: 427-38 (2015)
Article DOI: 10.1016/j.ejmech.2015.01.018
BindingDB Entry DOI: 10.7270/Q20C4XFX