BDBM50072406 CHEMBL3409337
SMILES: Nc1nc2[nH]cc(CCCCCCc3ccc(s3)C(=O)N[C@@H](CCC(O)=O)C(O)=O)c2c(=O)[nH]1
InChI Key: InChIKey=BSXZWPIJIYKAQE-AWEZNQCLSA-N
Data: 3 IC50
Activity Spreadsheet -- Enzyme Inhibition Constant Data from BindingDB
Found 3 hits for monomerid = 50072406
Trg + Lig
Ki
nM
ΔG°
kcal/mole
IC50
nM
Kd
nM
EC50/IC50
nM
koff
s-1
kon
M-1s-1
pHTemp
°C
Folate transporter 1
(Homo sapiens (Human))
BDBM50072406
(CHEMBL3409337)
Show SMILES Nc1nc2[nH]cc(CCCCCCc3ccc(s3)C(=O)N[C@@H](CCC(O)=O)C(O)=O)c2c(=O)[nH]1 |r|
Show InChI InChI=1S/C22H27N5O6S/c23-22-26-18-17(20(31)27-22)12(11-24-18)5-3-1-2-4-6-13-7-9-15(34-13)19(30)25-14(21(32)33)8-10-16(28)29/h7,9,11,14H,1-6,8,10H2,(H,25,30)(H,28,29)(H,32,33)(H4,23,24,26,27,31)/t14-/m0/s1
Reactome pathway
n/an/a>1.00E+3n/an/an/an/an/an/a
Duquesne University
Curated by ChEMBL
Assay Description
Binding affinity to human RFC expressed in Chinese hamster PC43-10 cells assessed as cell growth inhibition after 96 hrs by CellTiter-Blue assay
J Med Chem 58: 1479-93 (2015)
Article DOI: 10.1021/jm501787c
BindingDB Entry DOI: 10.7270/Q26W9CSQ
Proton-coupled folate transporter
(Homo sapiens (Human))
BDBM50072406
(CHEMBL3409337)
Show SMILES Nc1nc2[nH]cc(CCCCCCc3ccc(s3)C(=O)N[C@@H](CCC(O)=O)C(O)=O)c2c(=O)[nH]1 |r|
Show InChI InChI=1S/C22H27N5O6S/c23-22-26-18-17(20(31)27-22)12(11-24-18)5-3-1-2-4-6-13-7-9-15(34-13)19(30)25-14(21(32)33)8-10-16(28)29/h7,9,11,14H,1-6,8,10H2,(H,25,30)(H,28,29)(H,32,33)(H4,23,24,26,27,31)/t14-/m0/s1
Reactome pathway
n/an/a>1.00E+3n/an/an/an/an/an/a
Duquesne University
Curated by ChEMBL
Assay Description
Binding affinity to human PCFT expressed in Chinese hamster R2/PCFT4 cells assessed as cell growth inhibition after 96 hrs by CellTiter-Blue assay
J Med Chem 58: 1479-93 (2015)
Article DOI: 10.1021/jm501787c
BindingDB Entry DOI: 10.7270/Q26W9CSQ
Folate receptor alpha
(Homo sapiens (Human))
BDBM50072406
(CHEMBL3409337)
Show SMILES Nc1nc2[nH]cc(CCCCCCc3ccc(s3)C(=O)N[C@@H](CCC(O)=O)C(O)=O)c2c(=O)[nH]1 |r|
Show InChI InChI=1S/C22H27N5O6S/c23-22-26-18-17(20(31)27-22)12(11-24-18)5-3-1-2-4-6-13-7-9-15(34-13)19(30)25-14(21(32)33)8-10-16(28)29/h7,9,11,14H,1-6,8,10H2,(H,25,30)(H,28,29)(H,32,33)(H4,23,24,26,27,31)/t14-/m0/s1
n/an/a>1.00E+3n/an/an/an/an/an/a
Duquesne University
Curated by ChEMBL
Assay Description
Binding affinity to human FRalpha expressed in Chinese hamster RT16 cells assessed as cell growth inhibition after 96 hrs by CellTiter-Blue assay
J Med Chem 58: 1479-93 (2015)
Article DOI: 10.1021/jm501787c
BindingDB Entry DOI: 10.7270/Q26W9CSQ