BDBM50072471 CHEMBL106456::{(S)-7-[(7-Amino-1H-benzoimidazol-2-ylmethyl)-methyl-carbamoyl]-4-methyl-3-oxo-2,3,4,5-tetrahydro-1H-benzo[e][1,4]diazepin-2-yl}-acetic acid
SMILES: CN(Cc1nc2c(N)cccc2[nH]1)C(=O)c1ccc2N[C@@H](CC(O)=O)C(=O)N(C)Cc2c1
InChI Key: InChIKey=JQYCFEBYEBNEHP-KRWDZBQOSA-N
Data: 1 KI  1 IC50
Activity Spreadsheet -- Enzyme Inhibition Constant Data from BindingDB
Found 2 hits for monomerid = 50072471
Trg + Lig
Ki
nM
ΔG°
kcal/mole
IC50
nM
Kd
nM
EC50/IC50
nM
koff
s-1
kon
M-1s-1
pHTemp
°C
ITGAV/ITGB3
(Homo sapiens (Human))
BDBM50072471
(CHEMBL106456 | {(S)-7-[(7-Amino-1H-benzoimidazol-2...)
Show SMILES CN(Cc1nc2c(N)cccc2[nH]1)C(=O)c1ccc2N[C@@H](CC(O)=O)C(=O)N(C)Cc2c1
Show InChI InChI=1S/C22H24N6O4/c1-27-10-13-8-12(6-7-15(13)24-17(22(27)32)9-19(29)30)21(31)28(2)11-18-25-16-5-3-4-14(23)20(16)26-18/h3-8,17,24H,9-11,23H2,1-2H3,(H,25,26)(H,29,30)/t17-/m0/s1
5.5n/an/an/an/an/an/an/an/a
SmithKline Beecham Pharmaceuticals
Curated by ChEMBL
Assay Description
Binding affinity evaluated against vitronectin receptor (alphaV-beta3) receptor
Bioorg Med Chem Lett 8: 3165-70 (1999)
BindingDB Entry DOI: 10.7270/Q2NG4PSF
ITGAV/ITGB3
(Homo sapiens (Human))
BDBM50072471
(CHEMBL106456 | {(S)-7-[(7-Amino-1H-benzoimidazol-2...)
Show SMILES CN(Cc1nc2c(N)cccc2[nH]1)C(=O)c1ccc2N[C@@H](CC(O)=O)C(=O)N(C)Cc2c1
Show InChI InChI=1S/C22H24N6O4/c1-27-10-13-8-12(6-7-15(13)24-17(22(27)32)9-19(29)30)21(31)28(2)11-18-25-16-5-3-4-14(23)20(16)26-18/h3-8,17,24H,9-11,23H2,1-2H3,(H,25,26)(H,29,30)/t17-/m0/s1
n/an/a 810n/an/an/an/an/an/a
SmithKline Beecham Pharmaceuticals
Curated by ChEMBL
Assay Description
Binding affinity evaluated against vitronectin receptor (alphaV-beta3) receptor
Bioorg Med Chem Lett 8: 3165-70 (1999)
BindingDB Entry DOI: 10.7270/Q2NG4PSF