BDBM50072676 CHEMBL1951441
SMILES: CC(C)NC(=O)c1cccc(NC(=O)Nc2ccc(cc2)-c2ccnc(N)n2)c1
InChI Key: InChIKey=UOJBZXDYIJDUAP-UHFFFAOYSA-N
Data: 2 IC50
Activity Spreadsheet -- Enzyme Inhibition Constant Data from BindingDB
Found 2 hits for monomerid = 50072676
Trg + Lig
Ki
nM
ΔG°
kcal/mole
IC50
nM
Kd
nM
EC50/IC50
nM
koff
s-1
kon
M-1s-1
pHTemp
°C
LIM domain kinase 1
(Homo sapiens (Human))
BDBM50072676
(CHEMBL1951441)
Show SMILES CC(C)NC(=O)c1cccc(NC(=O)Nc2ccc(cc2)-c2ccnc(N)n2)c1
Show InChI InChI=1S/C21H22N6O2/c1-13(2)24-19(28)15-4-3-5-17(12-15)26-21(29)25-16-8-6-14(7-9-16)18-10-11-23-20(22)27-18/h3-13H,1-2H3,(H,24,28)(H2,22,23,27)(H2,25,26,29)
Reactome pathway
n/an/a>1.00E+4n/an/an/an/an/an/a
Translational Research Institute
Curated by ChEMBL
Assay Description
Inhibition of human Limk1 using cofilin substrate, ATP and [gamma33P]ATP
J Med Chem 58: 1846-61 (2015)
Article DOI: 10.1021/jm501680m
BindingDB Entry DOI: 10.7270/Q2K64KRC
Rho-associated protein kinase 2
(Homo sapiens (Human))
BDBM50072676
(CHEMBL1951441)
Show SMILES CC(C)NC(=O)c1cccc(NC(=O)Nc2ccc(cc2)-c2ccnc(N)n2)c1
Show InChI InChI=1S/C21H22N6O2/c1-13(2)24-19(28)15-4-3-5-17(12-15)26-21(29)25-16-8-6-14(7-9-16)18-10-11-23-20(22)27-18/h3-13H,1-2H3,(H,24,28)(H2,22,23,27)(H2,25,26,29)
n/an/a 166n/an/an/an/an/an/a
Translational Research Institute
Curated by ChEMBL
Assay Description
Inhibition of human ROCK2 using KEAKEKRQEQIAKRRRLSSLRASTSKSGGSQK peptide substrate, ATP and [gamma33P]ATP
J Med Chem 58: 1846-61 (2015)
Article DOI: 10.1021/jm501680m
BindingDB Entry DOI: 10.7270/Q2K64KRC