BDBM50072679 CHEMBL3410028
SMILES: Cc1c[nH]c2ncnc(-c3ccc(NC(=O)Nc4ccccc4)cc3)c12
InChI Key: InChIKey=SMMFXIYWMJSZLD-UHFFFAOYSA-N
Data: 2 IC50
Activity Spreadsheet -- Enzyme Inhibition Constant Data from BindingDB
Found 2 hits for monomerid = 50072679
Trg + Lig
Ki
nM
ΔG°
kcal/mole
IC50
nM
Kd
nM
EC50/IC50
nM
koff
s-1
kon
M-1s-1
pHTemp
°C
LIM domain kinase 1
(Homo sapiens (Human))
BDBM50072679
(CHEMBL3410028)
Show SMILES Cc1c[nH]c2ncnc(-c3ccc(NC(=O)Nc4ccccc4)cc3)c12
Show InChI InChI=1S/C20H17N5O/c1-13-11-21-19-17(13)18(22-12-23-19)14-7-9-16(10-8-14)25-20(26)24-15-5-3-2-4-6-15/h2-12H,1H3,(H,21,22,23)(H2,24,25,26)
Reactome pathway
n/an/a 142n/an/an/an/an/an/a
Translational Research Institute
Curated by ChEMBL
Assay Description
Inhibition of human Limk1 using cofilin substrate, ATP and [gamma33P]ATP
J Med Chem 58: 1846-61 (2015)
Article DOI: 10.1021/jm501680m
BindingDB Entry DOI: 10.7270/Q2K64KRC
Rho-associated protein kinase 2
(Homo sapiens (Human))
BDBM50072679
(CHEMBL3410028)
Show SMILES Cc1c[nH]c2ncnc(-c3ccc(NC(=O)Nc4ccccc4)cc3)c12
Show InChI InChI=1S/C20H17N5O/c1-13-11-21-19-17(13)18(22-12-23-19)14-7-9-16(10-8-14)25-20(26)24-15-5-3-2-4-6-15/h2-12H,1H3,(H,21,22,23)(H2,24,25,26)
n/an/a 2.36E+3n/an/an/an/an/an/a
Translational Research Institute
Curated by ChEMBL
Assay Description
Inhibition of human ROCK2 using KEAKEKRQEQIAKRRRLSSLRASTSKSGGSQK peptide substrate, ATP and [gamma33P]ATP
J Med Chem 58: 1846-61 (2015)
Article DOI: 10.1021/jm501680m
BindingDB Entry DOI: 10.7270/Q2K64KRC