BDBM50072786 (E)-7-{4-[4-(2-Cyclohexyloxy-ethylcarbamoyl)-oxazol-2-yl]-phenyl}-7-pyridin-3-yl-hept-6-enoic acid::CHEMBL150289
SMILES: OC(=O)CCCC\C=C(/c1ccc(cc1)-c1nc(co1)C(=O)NCCOC1CCCCC1)c1cccnc1
InChI Key: InChIKey=XJKMOZFCIYEDDT-KBKYJPHKSA-N
Data: 1 IC50  1 Kd
Activity Spreadsheet -- Enzyme Inhibition Constant Data from BindingDB
Found 2 hits for monomerid = 50072786
Trg + Lig
Ki
nM
ΔG°
kcal/mole
IC50
nM
Kd
nM
EC50/IC50
nM
koff
s-1
kon
M-1s-1
pHTemp
°C
Prostanoid TP receptor
(Homo sapiens (Human))
BDBM50072786
((E)-7-{4-[4-(2-Cyclohexyloxy-ethylcarbamoyl)-oxazo...)
Show SMILES OC(=O)CCCC\C=C(/c1ccc(cc1)-c1nc(co1)C(=O)NCCOC1CCCCC1)c1cccnc1
Show InChI InChI=1S/C30H35N3O5/c34-28(35)12-6-2-5-11-26(24-8-7-17-31-20-24)22-13-15-23(16-14-22)30-33-27(21-38-30)29(36)32-18-19-37-25-9-3-1-4-10-25/h7-8,11,13-17,20-21,25H,1-6,9-10,12,18-19H2,(H,32,36)(H,34,35)/b26-11+
n/an/an/a 113n/an/an/an/an/a
Lilly Research Laboratories
Curated by ChEMBL
Assay Description
In vitro for antagonistic activity against thromboxane synthase receptor
J Med Chem 41: 5362-74 (1999)
Article DOI: 10.1021/jm980173n
BindingDB Entry DOI: 10.7270/Q2V123Z8
Thromboxane A2 Synthase (P450 TxA2)
(Homo sapiens (Human))
BDBM50072786
((E)-7-{4-[4-(2-Cyclohexyloxy-ethylcarbamoyl)-oxazo...)
Show SMILES OC(=O)CCCC\C=C(/c1ccc(cc1)-c1nc(co1)C(=O)NCCOC1CCCCC1)c1cccnc1
Show InChI InChI=1S/C30H35N3O5/c34-28(35)12-6-2-5-11-26(24-8-7-17-31-20-24)22-13-15-23(16-14-22)30-33-27(21-38-30)29(36)32-18-19-37-25-9-3-1-4-10-25/h7-8,11,13-17,20-21,25H,1-6,9-10,12,18-19H2,(H,32,36)(H,34,35)/b26-11+
n/an/a 33n/an/an/an/an/an/a
Lilly Research Laboratories
Curated by ChEMBL
Assay Description
In vitro for inhibitory activity against thromboxane synthase
J Med Chem 41: 5362-74 (1999)
Article DOI: 10.1021/jm980173n
BindingDB Entry DOI: 10.7270/Q2V123Z8