BDBM50073017 CHEMBL3410704
SMILES: CCCCNC(=O)c1cc2cccc(OCCCC)c2oc1=O
InChI Key: InChIKey=RRQQVSKOGMIVFA-UHFFFAOYSA-N
Data: 2 EC50
Activity Spreadsheet -- Enzyme Inhibition Constant Data from BindingDB
Found 2 hits for monomerid = 50073017
Trg + Lig
Ki
nM
ΔG°
kcal/mole
IC50
nM
Kd
nM
EC50/IC50
nM
koff
s-1
kon
M-1s-1
pHTemp
°C
Cannabinoid receptor 2
(Homo sapiens (Human))
BDBM50073017
(CHEMBL3410704)
Show SMILES CCCCNC(=O)c1cc2cccc(OCCCC)c2oc1=O
Show InChI InChI=1S/C18H23NO4/c1-3-5-10-19-17(20)14-12-13-8-7-9-15(22-11-6-4-2)16(13)23-18(14)21/h7-9,12H,3-6,10-11H2,1-2H3,(H,19,20)
Reactome pathway
n/an/an/an/a>1.00E+4n/an/an/an/a
Zhejiang University
Curated by ChEMBL
Assay Description
Agonist activity at CB2 receptor (unknown origin) expressed in CHO cells by calcium mobilization assay
Eur J Med Chem 93: 16-32 (2015)
Article DOI: 10.1016/j.ejmech.2015.01.054
BindingDB Entry DOI: 10.7270/Q28P626S
Cannabinoid receptor 1
(Homo sapiens (Human))
BDBM50073017
(CHEMBL3410704)
Show SMILES CCCCNC(=O)c1cc2cccc(OCCCC)c2oc1=O
Show InChI InChI=1S/C18H23NO4/c1-3-5-10-19-17(20)14-12-13-8-7-9-15(22-11-6-4-2)16(13)23-18(14)21/h7-9,12H,3-6,10-11H2,1-2H3,(H,19,20)
NCI pathway
Reactome pathway
n/an/an/an/a>1.00E+4n/an/an/an/a
Zhejiang University
Curated by ChEMBL
Assay Description
Agonist activity at CB1 receptor (unknown origin) expressed in CHO cells by calcium mobilization assay
Eur J Med Chem 93: 16-32 (2015)
Article DOI: 10.1016/j.ejmech.2015.01.054
BindingDB Entry DOI: 10.7270/Q28P626S