BDBM50073023 CHEMBL3410710
SMILES: CCCCOc1cccc2cc(C(=O)NC(C)C)c(=O)oc12
InChI Key: InChIKey=VCZQESXCRUNCBJ-UHFFFAOYSA-N
Data: 2 EC50
Activity Spreadsheet -- Enzyme Inhibition Constant Data from BindingDB
Found 2 hits for monomerid = 50073023
Trg + Lig
Ki
nM
ΔG°
kcal/mole
IC50
nM
Kd
nM
EC50/IC50
nM
koff
s-1
kon
M-1s-1
pHTemp
°C
Cannabinoid receptor 2
(Homo sapiens (Human))
BDBM50073023
(CHEMBL3410710)
Show SMILES CCCCOc1cccc2cc(C(=O)NC(C)C)c(=O)oc12
Show InChI InChI=1S/C17H21NO4/c1-4-5-9-21-14-8-6-7-12-10-13(16(19)18-11(2)3)17(20)22-15(12)14/h6-8,10-11H,4-5,9H2,1-3H3,(H,18,19)
Reactome pathway
n/an/an/an/a 103n/an/an/an/a
Zhejiang University
Curated by ChEMBL
Assay Description
Agonist activity at CB2 receptor (unknown origin) expressed in CHO cells by calcium mobilization assay
Eur J Med Chem 93: 16-32 (2015)
Article DOI: 10.1016/j.ejmech.2015.01.054
BindingDB Entry DOI: 10.7270/Q28P626S
Cannabinoid receptor 1
(Homo sapiens (Human))
BDBM50073023
(CHEMBL3410710)
Show SMILES CCCCOc1cccc2cc(C(=O)NC(C)C)c(=O)oc12
Show InChI InChI=1S/C17H21NO4/c1-4-5-9-21-14-8-6-7-12-10-13(16(19)18-11(2)3)17(20)22-15(12)14/h6-8,10-11H,4-5,9H2,1-3H3,(H,18,19)
NCI pathway
Reactome pathway
n/an/an/an/a>1.00E+4n/an/an/an/a
Zhejiang University
Curated by ChEMBL
Assay Description
Agonist activity at CB1 receptor (unknown origin) expressed in CHO cells by calcium mobilization assay
Eur J Med Chem 93: 16-32 (2015)
Article DOI: 10.1016/j.ejmech.2015.01.054
BindingDB Entry DOI: 10.7270/Q28P626S