null
SMILES: CCCCOc1c(OC)ccc2cc(C(=O)NC(C)C)c(=O)oc12
InChI Key: InChIKey=IFRQHOCQLJAGOH-UHFFFAOYSA-N
Activity Spreadsheet -- Enzyme Inhibition Constant Data from BindingDB
Found 2 hits for monomerid = 50073102
Trg + Lig
Ki
nM
ΔG°
kcal/mole
IC50
nM
Kd
nM
EC50/IC50
nM
koff
s-1
kon
M-1s-1
pHTemp
°C
Cannabinoid receptor 1
(Homo sapiens (Human))
BDBM50073102
(CHEMBL3410725)
Show SMILES CCCCOc1c(OC)ccc2cc(C(=O)NC(C)C)c(=O)oc12
Show InChI InChI=1S/C18H23NO5/c1-5-6-9-23-16-14(22-4)8-7-12-10-13(17(20)19-11(2)3)18(21)24-15(12)16/h7-8,10-11H,5-6,9H2,1-4H3,(H,19,20)
NCI pathway
Reactome pathway
n/an/a>1.00E+4n/an/an/an/an/an/a
Zhejiang University
Curated by ChEMBL
Assay Description
Antagonist activity at CB1 receptor (unknown origin) expressed in CHO cells up to 10 uM incubated for 10 mins prior to CP55940 addition by calcium mo...
Eur J Med Chem 93: 16-32 (2015)
Article DOI: 10.1016/j.ejmech.2015.01.054
BindingDB Entry DOI: 10.7270/Q28P626S
Cannabinoid receptor 2
(Homo sapiens (Human))
BDBM50073102
(CHEMBL3410725)
Show SMILES CCCCOc1c(OC)ccc2cc(C(=O)NC(C)C)c(=O)oc12
Show InChI InChI=1S/C18H23NO5/c1-5-6-9-23-16-14(22-4)8-7-12-10-13(17(20)19-11(2)3)18(21)24-15(12)16/h7-8,10-11H,5-6,9H2,1-4H3,(H,19,20)
Reactome pathway
n/an/a 162n/an/an/an/an/an/a
Zhejiang University
Curated by ChEMBL
Assay Description
Antagonist activity at CB2 receptor (unknown origin) expressed in CHO cells up to 10 uM incubated for 10 mins prior to CP55940 addition by calcium mo...
Eur J Med Chem 93: 16-32 (2015)
Article DOI: 10.1016/j.ejmech.2015.01.054
BindingDB Entry DOI: 10.7270/Q28P626S