BDBM50073160 CHEMBL3407762
SMILES: CCCCOc1nc(ccc1CNC(=O)C(C)c1ccc(NS(C)(=O)=O)c(F)c1)C(F)(F)Cl
InChI Key: InChIKey=LJTWPGNEUJLDBK-UHFFFAOYSA-N
Data: 2 KI  2 IC50
Activity Spreadsheet -- Enzyme Inhibition Constant Data from BindingDB
Found 4 hits for monomerid = 50073160
Trg + Lig
Ki
nM
ΔG°
kcal/mole
IC50
nM
Kd
nM
EC50/IC50
nM
koff
s-1
kon
M-1s-1
pHTemp
°C
Transient receptor potential cation channel subfamily V member 1
(Homo sapiens (Human))
BDBM50073160
(CHEMBL3407762)
Show SMILES CCCCOc1nc(ccc1CNC(=O)C(C)c1ccc(NS(C)(=O)=O)c(F)c1)C(F)(F)Cl
Show InChI InChI=1S/C21H25ClF3N3O4S/c1-4-5-10-32-20-15(7-9-18(27-20)21(22,24)25)12-26-19(29)13(2)14-6-8-17(16(23)11-14)28-33(3,30)31/h6-9,11,13,28H,4-5,10,12H2,1-3H3,(H,26,29)
Reactome pathway
0.0200n/an/an/an/an/an/an/an/a
Seoul National University
Curated by ChEMBL
Assay Description
Antagonist activity at human TRPV1 expressed in CHO cells assessed as inhibition of N-arachidonoyl dopamine-induced activity by FLIPR assay
Eur J Med Chem 93: 101-8 (2015)
Article DOI: 10.1016/j.ejmech.2015.02.001
BindingDB Entry DOI: 10.7270/Q2N0188S
Transient receptor potential cation channel subfamily V member 1
(Homo sapiens (Human))
BDBM50073160
(CHEMBL3407762)
Show SMILES CCCCOc1nc(ccc1CNC(=O)C(C)c1ccc(NS(C)(=O)=O)c(F)c1)C(F)(F)Cl
Show InChI InChI=1S/C21H25ClF3N3O4S/c1-4-5-10-32-20-15(7-9-18(27-20)21(22,24)25)12-26-19(29)13(2)14-6-8-17(16(23)11-14)28-33(3,30)31/h6-9,11,13,28H,4-5,10,12H2,1-3H3,(H,26,29)
Reactome pathway
0.300n/an/an/an/an/an/an/an/a
Seoul National University
Curated by ChEMBL
Assay Description
Antagonist activity at human TRPV1 expressed in CHO cells assessed as inhibition of capsaicin-induced activity by FLIPR assay
Eur J Med Chem 93: 101-8 (2015)
Article DOI: 10.1016/j.ejmech.2015.02.001
BindingDB Entry DOI: 10.7270/Q2N0188S
Transient receptor potential cation channel subfamily V member 1
(Homo sapiens (Human))
BDBM50073160
(CHEMBL3407762)
Show SMILES CCCCOc1nc(ccc1CNC(=O)C(C)c1ccc(NS(C)(=O)=O)c(F)c1)C(F)(F)Cl
Show InChI InChI=1S/C21H25ClF3N3O4S/c1-4-5-10-32-20-15(7-9-18(27-20)21(22,24)25)12-26-19(29)13(2)14-6-8-17(16(23)11-14)28-33(3,30)31/h6-9,11,13,28H,4-5,10,12H2,1-3H3,(H,26,29)
Reactome pathway
n/an/a 8.30n/an/an/an/an/an/a
Seoul National University
Curated by ChEMBL
Assay Description
Antagonist activity at human TRPV1 expressed in CHO cells assessed as inhibition of pH-induced activity by FLIPR assay
Eur J Med Chem 93: 101-8 (2015)
Article DOI: 10.1016/j.ejmech.2015.02.001
BindingDB Entry DOI: 10.7270/Q2N0188S
Transient receptor potential cation channel subfamily V member 1
(Homo sapiens (Human))
BDBM50073160
(CHEMBL3407762)
Show SMILES CCCCOc1nc(ccc1CNC(=O)C(C)c1ccc(NS(C)(=O)=O)c(F)c1)C(F)(F)Cl
Show InChI InChI=1S/C21H25ClF3N3O4S/c1-4-5-10-32-20-15(7-9-18(27-20)21(22,24)25)12-26-19(29)13(2)14-6-8-17(16(23)11-14)28-33(3,30)31/h6-9,11,13,28H,4-5,10,12H2,1-3H3,(H,26,29)
Reactome pathway
n/an/a 7n/an/an/an/an/an/a
Seoul National University
Curated by ChEMBL
Assay Description
Antagonist activity at human TRPV1 expressed in CHO cells assessed as inhibition of heat at 45 degC-induced activity by FLIPR assay
Eur J Med Chem 93: 101-8 (2015)
Article DOI: 10.1016/j.ejmech.2015.02.001
BindingDB Entry DOI: 10.7270/Q2N0188S