BDBM50073190 CHEMBL3408213
SMILES: Cn1cc(cn1)-c1ccc(cc1)-c1cncc(Cl)c1N1CCC2(CCNC2=O)CC1
InChI Key: InChIKey=LBFYQISQYCGDDW-UHFFFAOYSA-N
Data: 6 IC50
PDB links: 1 PDB ID matches this monomer.
Activity Spreadsheet -- Enzyme Inhibition Constant Data from BindingDB
Found 10 hits for monomerid = 50073190
Trg + Lig
Ki
nM
ΔG°
kcal/mole
IC50
nM
Kd
nM
EC50/IC50
nM
koff
s-1
kon
M-1s-1
pHTemp
°C
Cyclin-C
(Homo sapiens (Human))
BDBM50073190
(CHEMBL3408213)
Show SMILES Cn1cc(cn1)-c1ccc(cc1)-c1cncc(Cl)c1N1CCC2(CCNC2=O)CC1
Show InChI InChI=1S/C23H24ClN5O/c1-28-15-18(12-27-28)16-2-4-17(5-3-16)19-13-25-14-20(24)21(19)29-10-7-23(8-11-29)6-9-26-22(23)30/h2-5,12-15H,6-11H2,1H3,(H,26,30)
9n/an/an/an/an/an/an/an/a
TBA
Citation and Details
3D
3D Structure (crystal)
Protein kinase C, PKC; classical/novel
(Homo sapiens (Human))
BDBM50073190
(CHEMBL3408213)
Show SMILES Cn1cc(cn1)-c1ccc(cc1)-c1cncc(Cl)c1N1CCC2(CCNC2=O)CC1
Show InChI InChI=1S/C23H24ClN5O/c1-28-15-18(12-27-28)16-2-4-17(5-3-16)19-13-25-14-20(24)21(19)29-10-7-23(8-11-29)6-9-26-22(23)30/h2-5,12-15H,6-11H2,1H3,(H,26,30)
NCI pathway
Reactome pathway
61n/an/an/an/an/an/an/an/a
TBA
Citation and Details
Glycogen synthase kinase-3
(Homo sapiens (Human))
BDBM50073190
(CHEMBL3408213)
Show SMILES Cn1cc(cn1)-c1ccc(cc1)-c1cncc(Cl)c1N1CCC2(CCNC2=O)CC1
Show InChI InChI=1S/C23H24ClN5O/c1-28-15-18(12-27-28)16-2-4-17(5-3-16)19-13-25-14-20(24)21(19)29-10-7-23(8-11-29)6-9-26-22(23)30/h2-5,12-15H,6-11H2,1H3,(H,26,30)
NCI pathway
Reactome pathway
231n/an/an/an/an/an/an/an/a
TBA
Citation and Details
Glycogen synthase kinase-3 beta
(Homo sapiens (Human))
BDBM50073190
(CHEMBL3408213)
Show SMILES Cn1cc(cn1)-c1ccc(cc1)-c1cncc(Cl)c1N1CCC2(CCNC2=O)CC1
Show InChI InChI=1S/C23H24ClN5O/c1-28-15-18(12-27-28)16-2-4-17(5-3-16)19-13-25-14-20(24)21(19)29-10-7-23(8-11-29)6-9-26-22(23)30/h2-5,12-15H,6-11H2,1H3,(H,26,30)
NCI pathway
Reactome pathway
345n/an/an/an/an/an/an/an/a
TBA
Citation and Details
Cyclin-dependent kinase 8
(Homo sapiens (Human))
BDBM50073190
(CHEMBL3408213)
Show SMILES Cn1cc(cn1)-c1ccc(cc1)-c1cncc(Cl)c1N1CCC2(CCNC2=O)CC1
Show InChI InChI=1S/C23H24ClN5O/c1-28-15-18(12-27-28)16-2-4-17(5-3-16)19-13-25-14-20(24)21(19)29-10-7-23(8-11-29)6-9-26-22(23)30/h2-5,12-15H,6-11H2,1H3,(H,26,30)
Reactome pathway
n/an/a 7.20n/an/an/an/an/an/a
The Institute of Cancer Research
Curated by ChEMBL
Assay Description
Binding affinity to His-tagged CDK8 (unknown origin) after 60 mins by FRET based lanthascreen binding assay
J Med Chem 59: 1078-101 (2016)
BindingDB Entry DOI: 10.7270/Q29025P6
3D
3D Structure (crystal)
Glycogen synthase kinase-3 beta
(Homo sapiens (Human))
BDBM50073190
(CHEMBL3408213)
Show SMILES Cn1cc(cn1)-c1ccc(cc1)-c1cncc(Cl)c1N1CCC2(CCNC2=O)CC1
Show InChI InChI=1S/C23H24ClN5O/c1-28-15-18(12-27-28)16-2-4-17(5-3-16)19-13-25-14-20(24)21(19)29-10-7-23(8-11-29)6-9-26-22(23)30/h2-5,12-15H,6-11H2,1H3,(H,26,30)
NCI pathway
Reactome pathway
n/an/a 690n/an/an/an/an/an/a
The Institute of Cancer Research
Curated by ChEMBL
Assay Description
Inhibition of GSK3beta (unknown origin)
J Med Chem 58: 1717-35 (2015)
Article DOI: 10.1021/jm501436m
BindingDB Entry DOI: 10.7270/Q2H70HJ2
Glycogen synthase kinase-3
(Homo sapiens (Human))
BDBM50073190
(CHEMBL3408213)
Show SMILES Cn1cc(cn1)-c1ccc(cc1)-c1cncc(Cl)c1N1CCC2(CCNC2=O)CC1
Show InChI InChI=1S/C23H24ClN5O/c1-28-15-18(12-27-28)16-2-4-17(5-3-16)19-13-25-14-20(24)21(19)29-10-7-23(8-11-29)6-9-26-22(23)30/h2-5,12-15H,6-11H2,1H3,(H,26,30)
NCI pathway
Reactome pathway
n/an/a 462n/an/an/an/an/an/a
The Institute of Cancer Research
Curated by ChEMBL
Assay Description
Inhibition of GSK3alpha (unknown origin)
J Med Chem 58: 1717-35 (2015)
Article DOI: 10.1021/jm501436m
BindingDB Entry DOI: 10.7270/Q2H70HJ2
Poly [ADP-ribose] polymerase tankyrase-2
(Homo sapiens (Human))
BDBM50073190
(CHEMBL3408213)
Show SMILES Cn1cc(cn1)-c1ccc(cc1)-c1cncc(Cl)c1N1CCC2(CCNC2=O)CC1
Show InChI InChI=1S/C23H24ClN5O/c1-28-15-18(12-27-28)16-2-4-17(5-3-16)19-13-25-14-20(24)21(19)29-10-7-23(8-11-29)6-9-26-22(23)30/h2-5,12-15H,6-11H2,1H3,(H,26,30)
n/an/a 1.50E+4n/an/an/an/an/an/a
The Institute of Cancer Research
Curated by ChEMBL
Assay Description
Inhibition of GST-tagged TNKS2 (873 to 1166 aa) (unknown origin) after 90 mins by HTRF assay
J Med Chem 58: 1717-35 (2015)
Article DOI: 10.1021/jm501436m
BindingDB Entry DOI: 10.7270/Q2H70HJ2
Poly [ADP-ribose] polymerase tankyrase-1
(Homo sapiens (Human))
BDBM50073190
(CHEMBL3408213)
Show SMILES Cn1cc(cn1)-c1ccc(cc1)-c1cncc(Cl)c1N1CCC2(CCNC2=O)CC1
Show InChI InChI=1S/C23H24ClN5O/c1-28-15-18(12-27-28)16-2-4-17(5-3-16)19-13-25-14-20(24)21(19)29-10-7-23(8-11-29)6-9-26-22(23)30/h2-5,12-15H,6-11H2,1H3,(H,26,30)
n/an/a>1.00E+4n/an/an/an/an/an/a
The Institute of Cancer Research
Curated by ChEMBL
Assay Description
Inhibition of GST-tagged TNKS1 (1023 to 1327 aa) (unknown origin) after 90 mins by HTRF assay
J Med Chem 58: 1717-35 (2015)
Article DOI: 10.1021/jm501436m
BindingDB Entry DOI: 10.7270/Q2H70HJ2
Protein Wnt-3a
(Homo sapiens (Human))
BDBM50073190
(CHEMBL3408213)
Show SMILES Cn1cc(cn1)-c1ccc(cc1)-c1cncc(Cl)c1N1CCC2(CCNC2=O)CC1
Show InChI InChI=1S/C23H24ClN5O/c1-28-15-18(12-27-28)16-2-4-17(5-3-16)19-13-25-14-20(24)21(19)29-10-7-23(8-11-29)6-9-26-22(23)30/h2-5,12-15H,6-11H2,1H3,(H,26,30)
Reactome pathway
n/an/a 7n/an/an/an/an/an/a
The Institute of Cancer Research
Curated by ChEMBL
Assay Description
Inhibition of ligand-induced WNT3A signaling in human PA-1 cells harboring TCF preincubated for 6 hrs before ligand addition measured after 24 hrs by...
J Med Chem 58: 1717-35 (2015)
Article DOI: 10.1021/jm501436m
BindingDB Entry DOI: 10.7270/Q2H70HJ2