BDBM50073550 CHEMBL3408954
SMILES: C[C@H]1CN(Cc2ccc(\C=C\c3n[nH]c4cc(ccc34)[C@@H]3C[C@@]33C(=O)Nc4ccccc34)cc2)C[C@@H](C)N1C
InChI Key: InChIKey=URVYHEBYZIZVST-LCXZTEIGSA-N
Data: 1 IC50
Activity Spreadsheet -- Enzyme Inhibition Constant Data from BindingDB
Found 1 hit for monomerid = 50073550
Trg + Lig
Ki
nM
ΔG°
kcal/mole
IC50
nM
Kd
nM
EC50/IC50
nM
koff
s-1
kon
M-1s-1
pHTemp
°C
Serine/threonine-protein kinase PLK4
(Homo sapiens (Human))
BDBM50073550
(CHEMBL3408954)
Show SMILES C[C@H]1CN(Cc2ccc(\C=C\c3n[nH]c4cc(ccc34)[C@@H]3C[C@@]33C(=O)Nc4ccccc34)cc2)C[C@@H](C)N1C |r|
Show InChI InChI=1S/C33H35N5O/c1-21-18-38(19-22(2)37(21)3)20-24-10-8-23(9-11-24)12-15-29-26-14-13-25(16-31(26)36-35-29)28-17-33(28)27-6-4-5-7-30(27)34-32(33)39/h4-16,21-22,28H,17-20H2,1-3H3,(H,34,39)(H,35,36)/b15-12+/t21-,22+,28-,33-/m0/s1
NCI pathway
Reactome pathway
n/an/a 0.640n/an/an/an/an/an/a
TBA
Curated by ChEMBL
Assay Description
Inhibition of PLK4 (unknown origin) by ELISA
J Med Chem 58: 147-69 (2015)
BindingDB Entry DOI: 10.7270/Q2M0475V