BDBM50073854 2,10-dihydroxy-12-(3,4,5-trihydroxy-6-hydroxymethyltetrahydro-2H-2-pyranyl)-6,7,12,13-tetrahydro-5H-indolo[2,3-a]pyrrolo[3,4-c]carbazole-5,7-dione::CHEMBL286882
SMILES: OCC1OC(C(O)C(O)C1O)n1c2cc(O)ccc2c2c3C(=O)NC(=O)c3c3c4ccc(O)cc4[nH]c3c12
InChI Key: InChIKey=URWNZLQOQBNPOF-UHFFFAOYSA-N
Data: 2 IC50
PDB links: 1 PDB ID matches this monomer.
Activity Spreadsheet -- Enzyme Inhibition Constant Data from BindingDB
Found 2 hits for monomerid = 50073854
Trg + Lig
Ki
nM
ΔG°
kcal/mole
IC50
nM
Kd
nM
EC50/IC50
nM
koff
s-1
kon
M-1s-1
pHTemp
°C
DNA topoisomerase I (Topo I)
(Homo sapiens (Human))
BDBM50073854
(2,10-dihydroxy-12-(3,4,5-trihydroxy-6-hydroxymethy...)
Show SMILES OCC1OC(C(O)C(O)C1O)n1c2cc(O)ccc2c2c3C(=O)NC(=O)c3c3c4ccc(O)cc4[nH]c3c12
Show InChI InChI=1S/C26H21N3O9/c30-7-14-21(33)22(34)23(35)26(38-14)29-13-6-9(32)2-4-11(13)16-18-17(24(36)28-25(18)37)15-10-3-1-8(31)5-12(10)27-19(15)20(16)29/h1-6,14,21-23,26-27,30-35H,7H2,(H,28,36,37)
n/an/a 30n/an/an/an/an/an/a
deCODE BioStructures
Curated by ChEMBL
Assay Description
Inhibition of topoisomerase I-DNA complex in trapping assay
J Med Chem 48: 2336-45 (2005)
Article DOI: 10.1021/jm049146p
BindingDB Entry DOI: 10.7270/Q2CF9QVT
3D
3D Structure (crystal)
DNA topoisomerase I (Topo I)
(Homo sapiens (Human))
BDBM50073854
(2,10-dihydroxy-12-(3,4,5-trihydroxy-6-hydroxymethy...)
Show SMILES OCC1OC(C(O)C(O)C1O)n1c2cc(O)ccc2c2c3C(=O)NC(=O)c3c3c4ccc(O)cc4[nH]c3c12
Show InChI InChI=1S/C26H21N3O9/c30-7-14-21(33)22(34)23(35)26(38-14)29-13-6-9(32)2-4-11(13)16-18-17(24(36)28-25(18)37)15-10-3-1-8(31)5-12(10)27-19(15)20(16)29/h1-6,14,21-23,26-27,30-35H,7H2,(H,28,36,37)
n/an/a 2.30E+3n/an/an/an/an/an/a
MediChem Research, Inc.
Curated by ChEMBL
Assay Description
Concentration of the compound required to inhibit human DNA topoisomerase I (Topo I)
Bioorg Med Chem Lett 9: 145-50 (1999)
BindingDB Entry DOI: 10.7270/Q2571B6S
3D
3D Structure (crystal)