BDBM50074203 3-[3-(4-Furan-3-ylmethyl-piperazin-1-yl)-propyl]-5-[1,2,4]triazol-4-yl-1H-indole::CHEMBL164111
SMILES: C(CN1CCN(Cc2ccoc2)CC1)Cc1c[nH]c2ccc(cc12)-n1cnnc1
InChI Key: InChIKey=AOICDANERLKBGY-UHFFFAOYSA-N
Data: 2 IC50  1 EC50
Activity Spreadsheet -- Enzyme Inhibition Constant Data from BindingDB
Found 3 hits for monomerid = 50074203
Trg + Lig
Ki
nM
ΔG°
kcal/mole
IC50
nM
Kd
nM
EC50/IC50
nM
koff
s-1
kon
M-1s-1
pHTemp
°C
5-hydroxytryptamine receptor 1B
(Homo sapiens (Human))
BDBM50074203
(3-[3-(4-Furan-3-ylmethyl-piperazin-1-yl)-propyl]-5...)
Show SMILES C(CN1CCN(Cc2ccoc2)CC1)Cc1c[nH]c2ccc(cc12)-n1cnnc1
Show InChI InChI=1S/C22H26N6O/c1(6-26-7-9-27(10-8-26)14-18-5-11-29-15-18)2-19-13-23-22-4-3-20(12-21(19)22)28-16-24-25-17-28/h3-5,11-13,15-17,23H,1-2,6-10,14H2
Reactome pathway
n/an/a 27n/an/an/an/an/an/a
Merck, Sharp and Dohme Research Laboratories
Curated by ChEMBL
Assay Description
Displacement of [3H]-5-HT binding from cloned human 5-hydroxytryptamine 1B receptor stably expressed in CHO cells.
J Med Chem 42: 691-705 (1999)
Article DOI: 10.1021/jm980569z
BindingDB Entry DOI: 10.7270/Q2ZG6RDW
5-hydroxytryptamine receptor 1D
(Homo sapiens (Human))
BDBM50074203
(3-[3-(4-Furan-3-ylmethyl-piperazin-1-yl)-propyl]-5...)
Show SMILES C(CN1CCN(Cc2ccoc2)CC1)Cc1c[nH]c2ccc(cc12)-n1cnnc1
Show InChI InChI=1S/C22H26N6O/c1(6-26-7-9-27(10-8-26)14-18-5-11-29-15-18)2-19-13-23-22-4-3-20(12-21(19)22)28-16-24-25-17-28/h3-5,11-13,15-17,23H,1-2,6-10,14H2
Reactome pathway
n/an/a 1.10n/an/an/an/an/an/a
Merck, Sharp and Dohme Research Laboratories
Curated by ChEMBL
Assay Description
Displacement of [3H]-5-HT from human 5-hydroxytryptamine 1D receptor expressed in CHO cells
J Med Chem 42: 691-705 (1999)
Article DOI: 10.1021/jm980569z
BindingDB Entry DOI: 10.7270/Q2ZG6RDW
5-hydroxytryptamine receptor 1D
(Homo sapiens (Human))
BDBM50074203
(3-[3-(4-Furan-3-ylmethyl-piperazin-1-yl)-propyl]-5...)
Show SMILES C(CN1CCN(Cc2ccoc2)CC1)Cc1c[nH]c2ccc(cc12)-n1cnnc1
Show InChI InChI=1S/C22H26N6O/c1(6-26-7-9-27(10-8-26)14-18-5-11-29-15-18)2-19-13-23-22-4-3-20(12-21(19)22)28-16-24-25-17-28/h3-5,11-13,15-17,23H,1-2,6-10,14H2
Reactome pathway
n/an/an/an/a 0.300n/an/an/an/a
Merck, Sharp and Dohme Research Laboratories
Curated by ChEMBL
Assay Description
Stimulation of [35S]-GTP-gammaS, binding in CHO cells expressing the human 5-hydroxytryptamine 1D receptor.
J Med Chem 42: 691-705 (1999)
Article DOI: 10.1021/jm980569z
BindingDB Entry DOI: 10.7270/Q2ZG6RDW