BDBM50074242 (2S,3S)-2-((S)-2-{(S)-2-[(S)-2-Acetylamino-3-(4-phosphonooxy-phenyl)-propionylamino]-4-carboxy-butyrylamino}-4-carboxy-butyrylamino)-3-methyl-pentanoic acid::(S)-2-((S)-2-{(S)-2-[(S)-2-Acetylamino-3-(4-phosphonooxy-phenyl)-propionylamino]-4-carboxy-butyrylamino}-4-carboxy-butyrylamino)-3-methyl-pentanoic acid::CHEMBL23794
SMILES: CC[C@H](C)[C@H](NC(=O)[C@H](CCC(O)=O)NC(=O)[C@H](CCC(O)=O)NC(=O)[C@H](Cc1ccc(OP(O)(O)=O)cc1)NC(C)=O)C(O)=O
InChI Key: InChIKey=QDABCLMXECRBLW-ZHAMKKIJSA-N
Data: 3 IC50  3 Kd
Activity Spreadsheet -- Enzyme Inhibition Constant Data from BindingDB
Found 6 hits for monomerid = 50074242
Trg + Lig
Ki
nM
ΔG°
kcal/mole
IC50
nM
Kd
nM
EC50/IC50
nM
koff
s-1
kon
M-1s-1
pHTemp
°C
Tyrosine-protein kinase Lck
(Homo sapiens (Human))
BDBM50074242
((2S,3S)-2-((S)-2-{(S)-2-[(S)-2-Acetylamino-3-(4-ph...)
Show SMILES CC[C@H](C)[C@H](NC(=O)[C@H](CCC(O)=O)NC(=O)[C@H](CCC(O)=O)NC(=O)[C@H](Cc1ccc(OP(O)(O)=O)cc1)NC(C)=O)C(O)=O
Show InChI InChI=1S/C27H39N4O14P/c1-4-14(2)23(27(40)41)31-25(38)19(10-12-22(35)36)29-24(37)18(9-11-21(33)34)30-26(39)20(28-15(3)32)13-16-5-7-17(8-6-16)45-46(42,43)44/h5-8,14,18-20,23H,4,9-13H2,1-3H3,(H,28,32)(H,29,37)(H,30,39)(H,31,38)(H,33,34)(H,35,36)(H,40,41)(H2,42,43,44)/t14-,18-,19-,20-,23-/m0/s1
n/an/an/a 100n/an/an/an/an/a
Boehringer Ingelheim Pharmaceuticals Inc.
Curated by ChEMBL
Assay Description
Binding affinity of the compound against p56 Lck tyrosine kinase SH2 domain was measured using glutathione S-transferase (GST) fusion protein
J Med Chem 42: 722-9 (1999)
Article DOI: 10.1021/jm980612i
BindingDB Entry DOI: 10.7270/Q2Q23ZDX
Proto-oncogene tyrosine-protein kinase Src
(Homo sapiens (Human))
BDBM50074242
((2S,3S)-2-((S)-2-{(S)-2-[(S)-2-Acetylamino-3-(4-ph...)
Show SMILES CC[C@H](C)[C@H](NC(=O)[C@H](CCC(O)=O)NC(=O)[C@H](CCC(O)=O)NC(=O)[C@H](Cc1ccc(OP(O)(O)=O)cc1)NC(C)=O)C(O)=O
Show InChI InChI=1S/C27H39N4O14P/c1-4-14(2)23(27(40)41)31-25(38)19(10-12-22(35)36)29-24(37)18(9-11-21(33)34)30-26(39)20(28-15(3)32)13-16-5-7-17(8-6-16)45-46(42,43)44/h5-8,14,18-20,23H,4,9-13H2,1-3H3,(H,28,32)(H,29,37)(H,30,39)(H,31,38)(H,33,34)(H,35,36)(H,40,41)(H2,42,43,44)/t14-,18-,19-,20-,23-/m0/s1
n/an/a 9n/an/an/an/an/an/a
Aventis
Curated by ChEMBL
Assay Description
Binding affinity for Src SH2 domain in scintillation proximity binding assay (SPA)
J Med Chem 45: 2379-87 (2002)
BindingDB Entry DOI: 10.7270/Q21J992G
Proto-oncogene tyrosine-protein kinase Src
(Homo sapiens (Human))
BDBM50074242
((2S,3S)-2-((S)-2-{(S)-2-[(S)-2-Acetylamino-3-(4-ph...)
Show SMILES CC[C@H](C)[C@H](NC(=O)[C@H](CCC(O)=O)NC(=O)[C@H](CCC(O)=O)NC(=O)[C@H](Cc1ccc(OP(O)(O)=O)cc1)NC(C)=O)C(O)=O
Show InChI InChI=1S/C27H39N4O14P/c1-4-14(2)23(27(40)41)31-25(38)19(10-12-22(35)36)29-24(37)18(9-11-21(33)34)30-26(39)20(28-15(3)32)13-16-5-7-17(8-6-16)45-46(42,43)44/h5-8,14,18-20,23H,4,9-13H2,1-3H3,(H,28,32)(H,29,37)(H,30,39)(H,31,38)(H,33,34)(H,35,36)(H,40,41)(H2,42,43,44)/t14-,18-,19-,20-,23-/m0/s1
n/an/a 6.50E+3n/an/an/an/an/an/a
University of Rhode Island
Curated by ChEMBL
Assay Description
Concentration of compoound required for inhibiting the binding of the fluorescent probe to the c-Src tyrosine kinase SH2 domain by 50%
J Med Chem 47: 3131-41 (2004)
Article DOI: 10.1021/jm040008+
BindingDB Entry DOI: 10.7270/Q25B0370
Tyrosine-protein kinase Lck
(Homo sapiens (Human))
BDBM50074242
((2S,3S)-2-((S)-2-{(S)-2-[(S)-2-Acetylamino-3-(4-ph...)
Show SMILES CC[C@H](C)[C@H](NC(=O)[C@H](CCC(O)=O)NC(=O)[C@H](CCC(O)=O)NC(=O)[C@H](Cc1ccc(OP(O)(O)=O)cc1)NC(C)=O)C(O)=O
Show InChI InChI=1S/C27H39N4O14P/c1-4-14(2)23(27(40)41)31-25(38)19(10-12-22(35)36)29-24(37)18(9-11-21(33)34)30-26(39)20(28-15(3)32)13-16-5-7-17(8-6-16)45-46(42,43)44/h5-8,14,18-20,23H,4,9-13H2,1-3H3,(H,28,32)(H,29,37)(H,30,39)(H,31,38)(H,33,34)(H,35,36)(H,40,41)(H2,42,43,44)/t14-,18-,19-,20-,23-/m0/s1
n/an/an/a 100n/an/an/an/an/a
University of Maryland
Curated by ChEMBL
Assay Description
Dissociation constant for p56 Lck tyrosine kinase SH2 domain binding to C-terminal ITAM2 phosphopeptide
J Med Chem 47: 3502-11 (2004)
Article DOI: 10.1021/jm030470e
BindingDB Entry DOI: 10.7270/Q28915B4
Tyrosine-protein kinase Lck
(Homo sapiens (Human))
BDBM50074242
((2S,3S)-2-((S)-2-{(S)-2-[(S)-2-Acetylamino-3-(4-ph...)
Show SMILES CC[C@H](C)[C@H](NC(=O)[C@H](CCC(O)=O)NC(=O)[C@H](CCC(O)=O)NC(=O)[C@H](Cc1ccc(OP(O)(O)=O)cc1)NC(C)=O)C(O)=O
Show InChI InChI=1S/C27H39N4O14P/c1-4-14(2)23(27(40)41)31-25(38)19(10-12-22(35)36)29-24(37)18(9-11-21(33)34)30-26(39)20(28-15(3)32)13-16-5-7-17(8-6-16)45-46(42,43)44/h5-8,14,18-20,23H,4,9-13H2,1-3H3,(H,28,32)(H,29,37)(H,30,39)(H,31,38)(H,33,34)(H,35,36)(H,40,41)(H2,42,43,44)/t14-,18-,19-,20-,23-/m0/s1
n/an/an/a 100n/an/an/an/an/a
Boehringer Ingelheim Pharmaceuticals Inc.
Curated by ChEMBL
Assay Description
Binding affinity towards p56 Lck tyrosine kinase SH2 domain was determined by biological assay
J Med Chem 42: 1757-66 (1999)
Article DOI: 10.1021/jm980676t
BindingDB Entry DOI: 10.7270/Q29P32BR
Proto-oncogene tyrosine-protein kinase Src
(Homo sapiens (Human))
BDBM50074242
((2S,3S)-2-((S)-2-{(S)-2-[(S)-2-Acetylamino-3-(4-ph...)
Show SMILES CC[C@H](C)[C@H](NC(=O)[C@H](CCC(O)=O)NC(=O)[C@H](CCC(O)=O)NC(=O)[C@H](Cc1ccc(OP(O)(O)=O)cc1)NC(C)=O)C(O)=O
Show InChI InChI=1S/C27H39N4O14P/c1-4-14(2)23(27(40)41)31-25(38)19(10-12-22(35)36)29-24(37)18(9-11-21(33)34)30-26(39)20(28-15(3)32)13-16-5-7-17(8-6-16)45-46(42,43)44/h5-8,14,18-20,23H,4,9-13H2,1-3H3,(H,28,32)(H,29,37)(H,30,39)(H,31,38)(H,33,34)(H,35,36)(H,40,41)(H2,42,43,44)/t14-,18-,19-,20-,23-/m0/s1
n/an/a 150n/an/an/an/an/an/a
Aventis Pharma
Curated by ChEMBL
Assay Description
Binding affinity for p60 c-Src SH2 domain by scintillation proximity assay (SPA)
Bioorg Med Chem Lett 12: 1287-9 (2002)
BindingDB Entry DOI: 10.7270/Q2JQ10BP